program: Gaussian 09
title: 000273817
version: EM64L-G09RevD.01
frameworkgroup: C1[X(C14H24N2O)]
method: RPBEPBE
basis: SDD
operation: Freq
keyword: #p
keyword: freq=noraman
keyword: PBEPBE/SDD
title: #p freq=noraman PBEPBE/SDD
converged: YES YES NO NO
title: Mulliken charges:
elementType: O N N C C C C C C C C C C C C C C H H H H H H H H H H H H H H H H H H H H H H H H
charge: -0.269959 -0.451399 -0.587685 0.509221 0.306127 -0.344599 -0.476936 -0.492250 -0.499689 -0.488486 0.067646 -0.423753 -0.421724 -0.420393 -0.414024 -0.386405 -0.392466 0.229589 0.214747 0.190051 0.193499 0.214623 0.195799 0.220203 0.215967 0.194279 0.300643 0.201896 0.206153 0.207622 0.192524 0.250245 0.183699 0.185117 0.239727 0.192120 0.207915 0.179711 0.201531 0.277672 0.291443
chargesum: 0.00000
title: Mulliken charges with hydrogens summed into heavy atoms:
elementType: O N N C C C C C C C C C C C C C C
charge: -0.269959 -0.150756 -0.018570 0.509221 0.306127 -0.115010 -0.072138 -0.084128 -0.083687 -0.078240 0.067646 -0.015704 -0.021579 0.013551 0.010821 0.013630 -0.011224
polarizability: 1.96064964e+02 3.64637071e+00 1.41738085e+02 -9.70767968e-01 -1.24875359e-01 1.37965039e+02
1716.lowfreq: -27.5656 -16.2768 0.0004 0.0007 0.0009 15.0795 56.8458 75.1401 83.4238
frequency: 56.2937 75.0582 83.3622 121.7215 147.4002 170.6024 205.6031 218.2770 233.4018 251.5220 261.3419 266.3583 269.5709 290.5363 350.8676 370.5273 394.8776 421.4293 434.0617 462.9832 482.4132 492.4469 499.6172 510.9052 580.0356 584.9761 624.1429 663.9381 675.1267 718.6152 760.1074 780.9610 786.9977 818.3103 833.9582 845.9741 853.0537 904.9581 912.6701 922.6962 929.6736 936.8392 940.8170 969.2024 988.8928 1037.3177 1050.7724 1053.0358 1054.8037 1070.1173 1084.7527 1096.6923 1099.1869 1133.2404 1137.1146 1144.2013 1154.1099 1157.9859 1168.8869 1190.5402 1225.9495 1238.4867 1255.4430 1261.5772 1264.8369 1273.6361 1273.8125 1305.5337 1307.7552 1315.4900 1316.6012 1332.2617 1335.5616 1338.4036 1341.1553 1344.9816 1349.3332 1352.5142 1359.5146 1371.2184 1382.9031 1449.9184 1457.6834 1459.4563 1460.9734 1463.5704 1470.1207 1471.0412 1473.6048 1476.5266 1482.6834 1630.3855 1633.6239 2956.8465 2956.9601 2958.5412 2962.4505 2963.0103 2967.1381 2968.9276 2971.6549 2978.0613 2984.4642 2986.4686 3015.7100 3022.1025 3026.2040 3026.6354 3030.0461 3032.5115 3037.8490 3045.3179 3048.4982 3057.9422 3490.5242 3546.6159 3619.4427
redmass: 4.4346 3.5410 3.2117 3.1338 3.5127 2.9830 2.2507 2.0702 3.3537 1.5275 3.0077 2.2481 2.1973 2.5850 1.7476 1.7761 2.9885 3.1959 3.0365 1.7460 1.9777 1.9546 1.8413 3.2622 1.3291 3.6197 2.9613 3.2284 3.3092 6.1654 2.8291 1.6804 1.4844 2.0002 2.6532 1.8905 1.7602 2.5069 2.1568 1.4138 1.9776 2.5384 1.4118 2.5363 1.7965 2.4453 1.7451 1.8406 1.5317 1.9931 2.2479 1.6540 1.5975 1.4403 1.6872 1.7426 2.7908 2.5567 1.4062 2.9390 2.0934 1.6411 1.3596 1.2844 1.3450 1.5582 1.2696 1.3445 1.5281 1.6739 1.6338 1.4896 1.3894 1.4107 1.4668 1.4887 1.4084 1.4935 1.4240 1.9391 1.3590 1.0871 1.0837 1.0869 1.0880 1.0857 1.0841 1.0857 1.0859 1.0975 1.0912 1.1258 6.6057 1.0618 1.0612 1.0637 1.0587 1.0651 1.0663 1.0611 1.0607 1.0837 1.0625 1.0646 1.1012 1.1012 1.0957 1.0954 1.0980 1.0970 1.0997 1.1017 1.1019 1.1008 1.0446 1.0771 1.0994
irintensity: 0.6170 0.7447 0.0472 2.0919 1.1316 1.7987 5.7116 4.0276 0.8263 26.5092 2.7969 0.7472 14.8214 10.4397 1.4417 1.2896 1.7016 2.6504 12.3032 129.4187 126.1063 0.7907 14.1249 15.9161 84.1357 6.9458 7.7402 1.1560 0.1223 15.6648 16.9503 3.5641 0.4331 0.2625 4.9970 4.5334 15.0433 0.4382 9.9138 8.2360 5.4728 3.4701 4.1133 23.5212 5.9463 3.8784 0.9566 1.7063 0.5269 2.8339 7.1803 1.5769 0.7444 2.3952 2.6043 0.7798 13.3486 19.5605 2.0163 5.8489 2.2869 67.9475 13.8254 1.1029 4.9496 4.5254 2.2131 3.3266 14.5208 36.4391 20.5331 3.5365 0.0708 7.4959 2.1020 12.3134 0.1412 4.1135 1.0349 52.5358 6.6291 4.3599 1.5435 7.4455 9.5780 4.7643 2.9373 5.9045 37.3923 16.8720 7.5454 88.2921 310.8991 31.7973 26.9511 17.5835 26.3434 29.6927 28.9663 24.1677 44.1263 33.7963 58.1908 56.8039 37.3021 58.7761 41.2767 90.8176 67.3291 19.7074 32.9927 76.6744 20.5420 53.7742 2.2910 8.9080 3.0573
temp: 298.150 k
press: 1.00000 atm
elementType: 8 7 7 6 6 6 6 6 6 6 6 6 6 6 6 6 6 1 1 1 1 1 1 1 1 1 1 1 1 1 1 1 1 1 1 1 1 1 1 1 1
symmnumber: 1
zpe: 956213.2 jmol-1
zpe.correction: 0.364202 hartree
zpe.thermalcorrener: 0.380410 hartree
zpe.thermalcorrenthalpy: 0.381354 hartree
zpe.thermalcorrgfe: 0.322334 hartree
zpe.sumelectzpe: -731.300125 hartree
zpe.sumelectthermal: -731.283918 hartree
zpe.sumelectthermalent: -731.282973 hartree
zpe.sumelectthermalfe: -731.341993 hartree
dipole: 4.1660 3.3499 0.0588
dipole: 5.3461
quadrupole: -102.2937 -109.7295 -102.2621
quadrupole: -3.7321 -0.9915 0.4381
quadrupole: 2.4680 -4.9677 2.4997 -3.7321 -0.9915 0.4381
hfenergy: -731.6643276 hartree
pointgroup: C01 [X(C14H24N2O1)]
dipole: 1.6505374 -1.2980905 -0.1208908 debye
polarizability: 196.1239093|-3.2354805|141.674822|0.7544257|0.1634859|137.9693572 unknown
InChI: InChI=1S/C14H24N2O/c15-11-13(7-3-1-4-8-13)12(17)16-14(11)9-5-2-6-10-14/h11,16H,1-10,15H2
charge 0 multiplicity 1
41 atoms
O  -1.301036 2.288826 0.168487
N  0.755318 1.164334 0.200623
N  0.079953 -2.456827 0.157282
C  1.368896 -0.18304 0.203544
C  -1.168434 -0.234688 0.203733
C  0.10668 -1.068888 0.607631
C  1.965919 -0.542351 -1.188483
C  2.486826 -0.284087 1.277076
C  -2.291854 -0.440774 1.261555
C  -1.721074 -0.610513 -1.20891
C  -0.631283 1.213641 0.191976
C  3.196615 0.325559 -1.543671
C  3.739733 0.558161 0.936045
C  -3.631251 0.247363 0.908387
C  -3.038465 0.121386 -1.557743
C  4.297254 0.205903 -0.463671
C  -4.125905 -0.163642 -0.497189
H  0.113468 -1.10137 1.716606
H  1.189916 -0.437049 -1.969992
H  2.273025 -1.608265 -1.171282
H  2.780777 -1.351194 1.365795
H  2.073583 0.023269 2.257406
H  -1.935392 -0.080514 2.247654
H  -2.444697 -1.536791 1.350527
H  -1.909886 -1.703461 -1.203464
H  -0.964125 -0.405191 -1.991704
H  1.29987 2.028155 0.165333
H  2.888379 1.386748 -1.645784
H  3.593551 0.020848 -2.530958
H  4.515531 0.402647 1.710199
H  3.485853 1.63876 0.968797
H  -3.490702 1.343572 0.936061
H  -4.389006 -0.013421 1.673577
H  -3.38162 -0.204672 -2.559465
H  -2.855867 1.211518 -1.607451
H  4.681379 -0.8353 -0.451235
H  5.154199 0.861219 -0.711355
H  -4.374153 -1.246431 -0.505086
H  -5.055464 0.38325 -0.747566
H  0.638791 -3.115219 0.702008
H  0.143097 -2.606474 -0.851293
