program: Gaussian 09
title: 000273822
version: EM64L-G09RevD.01
frameworkgroup: C1[X(C14H15NO4)]
method: RPBEPBE
basis: SDD
operation: Freq
keyword: #p
keyword: freq=noraman
keyword: PBEPBE/SDD
title: #p freq=noraman PBEPBE/SDD
converged: YES YES NO NO
title: Mulliken charges:
elementType: O O O O N C C C C C C C C C C C C C C H H H H H H H H H H H H H H H
charge: -0.254080 -0.259544 -0.252796 -0.255517 -0.413535 -0.312806 0.382410 0.085698 -0.523022 0.239626 -0.425623 0.199067 -0.391702 -0.353628 0.269773 -0.271768 -0.216582 -0.502914 -0.507057 0.281742 0.242119 0.269960 0.294428 0.305902 0.258781 0.226560 0.221989 0.220428 0.236483 0.241110 0.241821 0.240140 0.233180 0.249358
chargesum: 0.00000
title: Mulliken charges with hydrogens summed into heavy atoms:
elementType: O O O O N C C C C C C C C C C C C C C
charge: -0.254080 -0.259544 -0.252796 -0.255517 -0.107633 -0.031064 0.382410 0.085698 -0.010944 0.239626 -0.131195 0.199067 -0.132921 -0.127067 0.269773 -0.049779 0.003846 0.216499 0.215621
polarizability: 2.05553204e+02 9.82355989e+00 1.41695054e+02 1.65840596e+01 -1.08966314e+01 1.54259126e+02
1716.lowfreq: -7.3297 0.0005 0.0006 0.0009 4.8390 6.9370 12.3272 23.0421 30.8814
frequency: 12.1054 22.9920 30.7792 53.3748 76.5433 79.7822 91.8505 101.5049 116.6145 141.2765 171.2713 205.0601 214.5952 218.5188 236.8962 257.1808 286.0076 343.9194 377.5281 424.9161 449.3014 459.6288 524.1130 547.0055 570.8458 575.8178 592.1213 638.3564 645.6556 682.1229 707.1758 744.6502 751.1583 763.3393 771.6927 817.9205 828.0412 852.3784 868.4756 885.8891 934.8205 945.6008 952.3368 961.1365 973.3510 1012.7736 1041.8066 1061.6072 1097.6033 1112.4664 1112.6692 1120.9828 1130.7507 1139.6582 1148.8125 1149.8870 1168.8783 1206.1285 1238.3108 1251.0749 1280.3078 1295.5658 1305.9615 1339.6240 1361.3153 1391.4309 1420.2852 1420.9927 1423.8937 1441.6668 1452.4696 1452.6574 1458.9451 1462.8655 1463.3337 1483.3254 1548.3806 1585.1478 1629.4245 1630.7890 1637.5805 2998.0144 3005.4250 3005.5736 3054.7176 3107.8686 3108.6330 3109.1211 3123.8104 3135.0787 3149.5900 3150.8948 3151.8076 3164.0565 3226.7981 3611.7586
redmass: 4.8738 4.6716 4.9099 5.3725 1.8692 1.9895 1.7103 1.5851 3.9311 4.7605 4.4555 5.0730 4.4104 4.1616 5.2854 3.5281 4.7989 5.4398 3.7948 2.8850 4.6231 4.3603 1.2787 6.8002 5.6624 2.9659 3.3860 3.6386 4.5740 5.5001 4.9162 4.6404 1.3818 3.8945 4.9262 5.6697 1.4678 1.4575 5.1579 6.6007 1.3779 4.9579 2.4316 6.7492 1.3035 2.1415 3.8011 4.0657 1.6321 1.2732 1.2763 2.2183 1.6913 1.8331 1.4699 1.4788 1.1054 1.6580 2.3711 1.5561 1.5324 2.2127 1.7229 1.5646 1.7393 4.9599 1.2697 1.1936 2.1145 1.1035 1.0505 1.0504 3.9647 1.0509 1.0504 3.0662 5.6525 6.0827 9.1316 6.8527 8.7270 1.0662 1.0294 1.0294 1.0841 1.1045 1.1040 1.0957 1.0852 1.0894 1.0950 1.1049 1.1048 1.1000 1.0987 1.0809
irintensity: 0.9520 1.5345 2.5880 2.1640 1.5881 1.3334 0.3547 0.7869 0.6701 0.2044 5.2652 8.1202 3.9471 7.9760 2.6415 7.4812 27.9682 2.7896 5.1684 14.0236 1.2971 14.4850 86.8672 1.1836 2.2479 8.4730 16.7950 0.7123 8.5172 3.2043 0.7836 4.9933 109.0190 6.4342 16.1705 24.5226 12.8068 1.2646 0.7415 6.5986 4.5425 11.7839 2.1866 70.9735 0.4376 12.2939 10.2135 4.5199 41.7928 1.7917 5.0749 340.0798 20.5641 5.0655 26.5286 1.8502 0.4251 71.7087 10.1082 16.7631 126.4405 14.0137 66.4014 5.4214 57.5561 18.9393 10.0209 31.9761 3.7222 22.1999 14.1947 13.9948 19.4945 12.2543 8.9842 2.7494 7.2803 1.6853 253.8698 12.3405 23.9416 16.9173 56.8193 7.9388 2.5946 23.7600 20.2782 11.0021 0.3332 14.3520 24.6879 16.0521 14.1532 23.3834 1.0629 59.9299
temp: 298.150 k
press: 1.00000 atm
elementType: 8 8 8 8 7 6 6 6 6 6 6 6 6 6 6 6 6 6 6 1 1 1 1 1 1 1 1 1 1 1 1 1 1 1
symmnumber: 1
zpe: 696754.0 jmol-1
zpe.correction: 0.265380 hartree
zpe.thermalcorrener: 0.284089 hartree
zpe.thermalcorrenthalpy: 0.285033 hartree
zpe.thermalcorrgfe: 0.214999 hartree
zpe.sumelectzpe: -896.758244 hartree
zpe.sumelectthermal: -896.739535 hartree
zpe.sumelectthermalent: -896.738590 hartree
zpe.sumelectthermalfe: -896.808625 hartree
dipole: -0.1309 -0.9675 1.7915
dipole: 2.0403
quadrupole: -97.0557 -97.6981 -108.9375
quadrupole: -4.3084 -9.4519 -4.4532
quadrupole: 4.1747 3.5323 -7.7070 -4.3084 -9.4519 -4.4532
hfenergy: -897.0236239 hartree
pointgroup: C01 [X(C14H15N1O4)]
dipole: 0.2297133 0.2111304 0.7395801 debye
polarizability: 198.9268791|-20.3375962|143.7459322|-12.1212876|16.1511805|158.8345728 unknown
InChI: InChI=1S/C14H15NO4/c1-18-13(16)7-10(14(17)19-2)11-8-15-12-6-4-3-5-9(11)12/h3-6,8,10,15H,7H2,1-2H3
charge 0 multiplicity 1
34 atoms
O  -2.571508 2.369423 -0.82746
O  -1.270659 -3.24093 0.500369
O  -2.897742 1.660247 1.3653
O  -1.105154 -2.26541 -1.606336
N  1.544713 1.005312 1.965451
C  -1.47307 0.328457 -0.167786
C  -0.100858 0.518311 0.460252
C  1.185357 0.233154 -0.155786
C  -2.148511 -1.0154 0.250722
C  2.201676 0.552524 0.814352
C  0.16109 0.983783 1.750812
C  -2.381899 1.487348 0.234641
C  1.580112 -0.264424 -1.42717
C  3.58038 0.40069 0.546447
C  -1.45668 -2.198027 -0.404701
C  2.952837 -0.414831 -1.699895
C  3.942913 -0.084909 -0.726047
C  -3.391548 3.57051 -0.528027
C  -0.607063 -4.452365 -0.045527
H  -1.373428 0.339717 -1.266593
H  -3.201931 -1.020171 -0.0940
H  -2.15041 -1.129234 1.344913
H  -0.541296 1.305696 2.517451
H  1.999645 1.314478 2.821325
H  0.828552 -0.544389 -2.172938
H  4.343029 0.648025 1.293605
H  3.271455 -0.796404 -2.676252
H  5.003056 -0.214483 -0.971343
H  -3.435403 4.12182 -1.477316
H  -2.908419 4.171466 0.260551
H  -4.398255 3.271763 -0.19103
H  -1.19451 -4.86647 -0.882116
H  -0.566866 -5.153352 0.799603
H  0.404797 -4.197927 -0.40257
