program: Gaussian 09
title: 000273809
version: EM64L-G09RevD.01
frameworkgroup: C1[X(C18H19N)]
method: RPBEPBE
basis: SDD
operation: Freq
keyword: #pfreq=noraman
keyword: PBEPBE/SDD
title: #p freq=noraman PBEPBE/SDD
converged: YES YES NO NO
title: Mulliken charges:
elementType: N C C C C C C C C C C C C C C C C C C H H H H H H H H H H H H H H H H H H H
charge: -0.245135 -0.026719 -0.572430 -0.437015 0.351074 -0.569207 0.295307 0.231057 0.187769 -0.583276 -0.594651 -0.747272 0.188398 0.236173 -0.649773 -0.403386 -0.382522 -0.258287 -0.229751 0.213093 0.209087 0.217769 0.202089 0.204788 0.215585 0.221156 0.236750 0.238835 0.207945 0.212410 0.218670 0.237991 0.234805 0.236080 0.232852 0.229231 0.220609 0.219900
chargesum: 0.00000
title: Mulliken charges with hydrogens summed into heavy atoms:
elementType: N C C C C C C C C C C C C C C C C C C
charge: -0.245135 0.186373 -0.145574 -0.030137 0.351074 -0.132465 0.295307 0.231057 0.187769 -0.346526 -0.355816 -0.108246 0.188398 0.236173 0.059103 -0.170534 -0.153291 -0.037678 -0.009851
polarizability: 3.32862464e+02 -9.39622397e+00 2.03545590e+02 -4.62067709e-01 1.86149009e+00 1.02747174e+02
1716.lowfreq: -6.7111 -0.0005 0.0006 0.0007 2.0400 10.6220 46.3479 48.6351 76.1482
frequency: 46.2812 48.2043 76.1190 101.6438 123.7937 131.2744 180.8259 209.8069 216.8936 222.1649 238.0501 263.8034 309.5754 337.3390 349.5164 370.4412 421.5000 435.0722 443.0785 451.2586 488.4645 542.2070 570.9219 575.5518 586.4505 636.2748 641.0265 689.8973 724.7376 729.7400 740.9368 751.3834 772.4066 799.1697 836.4036 845.4409 850.0219 885.9724 892.5313 914.1779 929.2541 931.2878 958.9292 968.2949 969.2897 1016.5293 1026.4293 1052.1177 1078.8130 1097.9223 1115.1483 1117.9722 1129.3422 1134.2356 1151.5965 1162.8924 1168.6471 1194.0026 1217.9970 1240.7050 1248.6848 1255.8949 1263.5751 1292.5483 1306.8175 1319.1340 1334.0128 1339.2216 1358.5618 1366.6282 1385.7046 1399.5763 1405.8878 1429.9343 1447.4300 1451.7636 1460.4171 1464.8848 1469.2268 1471.1782 1475.1492 1475.5536 1477.6241 1490.8641 1496.2377 1576.9431 1589.4741 1616.1450 1645.0954 2938.5460 2951.9662 2957.8920 2964.6364 2968.2981 2971.0074 3008.0099 3014.7557 3033.2410 3057.4104 3058.5822 3066.4613 3094.0103 3115.7884 3122.1265 3124.4290 3132.8725 3146.2498 3163.2766
redmass: 2.1059 1.4012 2.6788 3.6039 3.0534 4.1151 2.7170 1.1159 3.5974 3.1608 2.4928 2.4659 4.0912 4.3209 3.2458 3.8365 2.2455 2.5589 3.8840 3.1089 4.0138 4.9840 3.9003 4.2047 4.8562 4.7763 4.3478 4.1252 5.0604 2.7404 3.3467 1.7580 2.9794 2.1652 3.5998 1.4375 1.4836 1.6437 1.5317 2.0653 1.8087 1.4357 1.5002 2.2510 1.3940 2.0395 2.4752 3.2759 2.7621 1.8216 1.3152 1.6591 1.5565 1.1892 1.9524 1.8202 1.4110 1.7516 1.4705 2.3086 1.5015 1.7670 1.6575 1.4229 1.3162 1.7138 1.7855 1.4908 2.2657 2.3763 1.2416 4.3814 4.3419 1.8576 2.3189 1.1756 1.1334 2.2595 1.2746 1.6779 1.0550 1.1229 1.0754 1.3853 3.0753 7.5649 6.8531 7.5563 7.7689 1.0661 1.0648 1.0759 1.0383 1.0400 1.0637 1.0956 1.0938 1.1024 1.0943 1.0989 1.0992 1.1005 1.0912 1.0911 1.0846 1.0891 1.0949 1.1001
irintensity: 0.3617 0.0449 0.8070 1.8386 2.9857 0.4364 0.1892 0.0103 0.0994 0.0904 0.2247 0.2144 1.1229 0.2598 0.3610 3.6186 5.2329 4.7652 0.3108 3.1506 0.8604 4.7500 0.8129 0.1812 4.6596 4.6504 0.8153 1.4089 2.8702 20.6494 3.7451 67.7542 10.1269 0.3165 13.1233 19.1668 2.3466 7.5376 3.4117 4.0667 17.6689 0.1075 6.8105 0.8795 0.0993 16.9970 4.1896 0.9395 0.4578 2.8465 6.5865 30.1326 11.7811 1.0763 2.0622 1.1775 3.3959 3.9034 5.3866 0.5563 11.8904 18.3334 36.1954 4.6492 1.9066 16.0263 36.0230 3.0291 5.0335 17.0764 11.1677 8.2940 42.5212 11.8110 1.5742 3.1587 11.1594 22.9079 24.9439 33.6523 15.4150 41.6162 9.2704 57.3449 28.5509 3.5112 4.2604 44.9091 17.7885 22.9561 33.1931 14.8340 30.5785 81.2595 82.2687 33.6593 34.6712 53.6772 23.5261 66.1822 48.3293 10.9566 18.5670 8.9753 1.5668 4.4387 35.9727 38.7519
temp: 298.150 k
press: 1.00000 atm
elementType: 7 6 6 6 6 6 6 6 6 6 6 6 6 6 6 6 6 6 6 1 1 1 1 1 1 1 1 1 1 1 1 1 1 1 1 1 1 1
symmnumber: 1
zpe: 839273.0 jmol-1
zpe.correction: 0.319662 hartree
zpe.thermalcorrener: 0.335856 hartree
zpe.thermalcorrenthalpy: 0.336800 hartree
zpe.thermalcorrgfe: 0.276282 hartree
zpe.sumelectzpe: -750.755417 hartree
zpe.sumelectthermal: -750.739223 hartree
zpe.sumelectthermalent: -750.738279 hartree
zpe.sumelectthermalfe: -750.798797 hartree
dipole: -0.7396 1.8824 -0.0034
dipole: 2.0225
quadrupole: -104.9458 -97.7482 -118.4945
quadrupole: 5.2468 0.4937 0.3004
quadrupole: 2.1171 9.3146 -11.4317 5.2468 0.4937 0.3004
hfenergy: -751.0750791 hartree
pointgroup: C01 [X(C18H19N1)]
dipole: -0.2979617 -0.7378219 0.0022098 debye
polarizability: 333.0272553|8.1760719|203.3852679|0.6235984|1.7156762|102.7427057 unknown
InChI: InChI=1S/C18H19N/c1-12-7-8-13-10-16-15-5-3-4-6-17(15)19(2)18(16)11-14(13)9-12/h3-6,10-12H,7-9H2,1-2H3
charge 0 multiplicity 1
38 atoms
N  1.686613 -1.554944 0.011122
C  -4.476013 -0.078977 0.348647
C  -3.37141 -1.072349 -0.082778
C  -4.246539 1.268597 -0.374749
C  -1.956171 -0.498667 -0.019194
C  -2.903775 1.898134 0.054107
C  -1.731903 0.917185 0.003844
C  0.449573 -0.877885 -0.00331
C  0.692595 0.538347 0.00833
C  -0.859449 -1.395164 -0.020699
C  -0.409235 1.418962 0.013014
C  -5.880243 -0.653296 0.069788
C  2.13967 0.718119 0.013266
C  2.721765 -0.599394 0.004505
C  1.862744 -3.003019 -0.033074
C  2.985614 1.850518 0.024867
C  4.119915 -0.793357 -0.003723
C  4.385044 1.663782 0.023641
C  4.942743 0.354984 0.008189
H  -4.377679 0.102558 1.440501
H  -3.585571 -1.388531 -1.127378
H  -3.428113 -1.992366 0.532134
H  -5.075474 1.968711 -0.153107
H  -4.252567 1.092631 -1.470424
H  -3.009041 2.279699 1.091981
H  -2.676022 2.780835 -0.574572
H  -1.04815 -2.475007 -0.044876
H  -0.247853 2.504301 0.025458
H  -6.03019 -0.809164 -1.016505
H  -6.026785 -1.627889 0.572948
H  -6.671281 0.033491 0.424183
H  1.887968 -3.388201 -1.071511
H  2.80527 -3.281495 0.467812
H  1.036769 -3.498316 0.505373
H  2.563026 2.861582 0.033659
H  4.564729 -1.793841 -0.025514
H  5.051572 2.533011 0.031757
H  6.031953 0.23372 0.002489
