program: Gaussian 09
title: 000026311
version: EM64L-G09RevD.01
frameworkgroup: C1[X(C3H6N4O3)]
method: RPBEPBE
basis: SDD
operation: Freq
keyword: #pfreq=noraman
keyword: PBEPBE/SDD
title: #p freq=noraman PBEPBE/SDD
converged: NO YES NO NO
title: Mulliken charges:
elementType: O O O N N N N C C C H H H H H H
charge: -0.191285 -0.218575 -0.233504 -0.167481 -0.454480 0.035144 -0.647418 0.386484 -0.618748 0.298353 0.339097 0.278625 0.260328 0.260306 0.319128 0.354024
chargesum: 0.00000
title: Mulliken charges with hydrogens summed into heavy atoms:
elementType: O O O N N N N C C C
charge: -0.191285 -0.218575 -0.233504 -0.167481 -0.115383 0.035144 0.025734 0.386484 0.180512 0.298353
polarizability: 1.01462280e+02 4.71496138e+00 8.89158468e+01 -7.19358248e-03 3.78627768e-03 3.56894318e+01
1716.lowfreq: -12.5495 -10.4794 -0.0006 -0.0005 0.0003 6.2978 7.3995 84.7079 117.1168
frequency: -12.2633 84.7050 117.1161 126.6938 128.7243 213.4494 242.8058 315.5752 364.0090 377.7183 390.3843 397.0812 496.8714 548.2426 568.5311 691.4206 726.0681 761.5381 782.4521 848.9935 896.0640 908.3646 1061.3572 1116.4548 1120.4515 1189.8204 1247.8555 1317.7479 1369.3975 1417.5487 1462.6074 1468.6438 1486.1224 1616.2045 1669.9315 1722.2470 3007.8451 3093.9906 3149.4090 3409.4093 3535.6274 3690.6050
redmass: 5.7917 3.9134 4.1600 6.4652 1.1804 6.5696 9.8495 3.5994 4.8353 1.2853 7.1813 4.0296 8.8973 1.1545 4.0955 8.8578 3.6289 5.6023 1.4321 5.8341 3.5422 3.6267 2.0477 1.3275 3.1778 2.5934 3.8526 4.1663 8.3214 1.2086 1.0428 1.0926 2.0053 1.1886 5.0451 9.6063 1.0336 1.1011 1.1011 1.0770 1.0462 1.1041
irintensity: 13.5654 7.4862 4.4775 13.6140 0.1099 0.0021 6.2672 3.9496 7.6185 49.4968 5.5810 21.8022 2.4397 238.4039 44.7217 2.3474 4.5111 42.4179 167.1707 51.7297 10.5101 243.8971 5.3963 0.4545 81.4728 27.0581 109.3266 132.6432 160.4451 38.9194 23.6899 41.8056 941.8093 34.8509 13.6617 468.8951 9.7289 11.5673 0.4075 86.0505 51.3734 44.1850
temp: 298.150 k
press: 1.00000 atm
elementType: 8 8 8 7 7 7 7 6 6 6 1 1 1 1 1 1
symmnumber: 1
zpe: 293923.0 jmol-1
zpe.correction: 0.111949 hartree
zpe.thermalcorrener: 0.121678 hartree
zpe.thermalcorrenthalpy: 0.122622 hartree
zpe.thermalcorrgfe: 0.076725 hartree
zpe.sumelectzpe: -561.793322 hartree
zpe.sumelectthermal: -561.783593 hartree
zpe.sumelectthermalent: -561.782649 hartree
zpe.sumelectthermalfe: -561.828547 hartree
dipole: -0.4185 -3.6896 -0.0078
dipole: 3.7132
quadrupole: -56.0720 -61.9828 -57.2018
quadrupole: -22.0419 -0.0177 0.0142
quadrupole: 2.3469 -3.5639 1.2170 -22.0419 -0.0177 0.0142
hfenergy: -561.9052712 hartree
pointgroup: C01 [X(C3H6N4O3)]
dipole: -0.2695149 1.4358164 0.0030673 debye
dipolederiv: -0.6052541 0.0933895 -0.0004723 -0.0630774 -0.9637706 0.0013735 -0.0001302 -0.0010326 -0.3204505 -0.8660334 0.2031787 0.0011038 0.2424145 -0.7997555 -0.0019885 -0.0008273 0.0008956 -0.3518777 -0.910616 0.7331761 -0.0004787 0.1207922 -0.4487318 0.0001296 -0.0004415 0.0005966 -0.1823971 -1.0252883 0.2943594 0.0001651 0.7813497 -0.8248839 0.0004383 -0.0011132 0.0009569 -0.1248803 -2.0336023 -0.4769942 0.0000549 -0.4971158 -0.6598445 0.00012 0.003239 0.0009172 -0.3520428 0.4728662 -0.7917256 0.0004002 -0.8168085 0.9078814 -0.0008073 0.0003274 -0.0011453 -0.0532857 -0.6445592 -0.4271142 0.0003372 -0.4911298 -1.0002832 0.0008288 0.0002187 -0.0001448 -0.7728896 2.2053553 -0.1524051 0.0003176 0.4436992 1.4413952 -0.0018578 0.0004159 -0.0002814 0.3497668 0.1322063 0.0126141 -0.0000891 0.1532738 0.0706445 0.000112 -0.0004177 0.0001043 0.2032776 2.3127849 0.3930535 -0.0016168 0.0739009 1.6053189 0.0026574 -0.0012867 0.0009935 0.3721158 0.3697438 0.0084082 0.0004951 -0.0825212 0.1484836 0.0001123 0.0007553 0.0000365 0.3158109 0.159175 0.0913022 -0.0001098 0.0126068 0.035378 0.0000612 -0.0000451 0.0000624 0.1454404 0.0239043 -0.035006 -0.0650618 0.0198937 0.0700068 0.0640533 -0.0759204 0.004907 -0.022376 0.0235789 -0.0350683 0.0653069 0.0201765 0.0699792 -0.0640567 0.076165 -0.0050099 -0.0221114 0.1615071 0.0469113 -0.0002431 0.0691236 0.1608741 -0.0006513 -0.0004051 -0.0010327 0.411271 0.2242316 0.0419205 -0.0001091 0.0134215 0.1873077 -0.0005248 -0.000534 -0.0008233 0.4046284 unknown
polarizability: 102.078581|-3.7574805|88.2995462|0.0068999|0.0042982|35.6894318 unknown
InChI: InChI=1S/C3H6N4O3/c1-7(6-10)3(9)5-2(4)8/h5H,4H2,1H3
charge 0 multiplicity 1
16 atoms
O  0.223975 -1.927232 0.000284
O  2.914366 -0.735359 -0.001296
O  -2.927494 1.423397 -0.000992
N  -1.453713 -0.276245 0.000615
N  0.811003 0.380493 -0.000263
N  -1.692235 1.097022 -0.000292
N  2.807284 1.592371 0.000192
C  -0.049489 -0.711856 0.001998
C  -2.548332 -1.259852 -0.000282
C  2.241979 0.320973 -0.003089
H  0.326886 1.28957 0.00048
H  -2.094117 -2.260368 0.000498
H  -3.178773 -1.119977 -0.895035
H  -3.1806 -1.11945 0.893094
H  2.274782 2.460397 0.002078
H  3.823679 1.638716 0.001811
