program: Gaussian 09
title: 000273811
version: EM64L-G09RevD.01
frameworkgroup: C1[X(C18H14N2)]
method: RPBEPBE
basis: SDD
operation: Freq
keyword: #pfreq=noraman
keyword: PBEPBE/SDD
title: #p freq=noraman PBEPBE/SDD
converged: YES YES NO NO
title: Mulliken charges:
elementType: N N C C C C C C C C C C C C C C C C C C H H H H H H H H H H H H H H
charge: -0.400879 -0.400925 0.234930 0.234457 0.358661 0.100516 0.101146 0.195104 0.195168 -0.433051 -0.432973 -0.365737 -0.366470 -0.363846 -0.363790 -0.755008 -0.262570 -0.262218 -0.220786 -0.220840 0.277796 0.277885 0.303272 0.303238 0.249617 0.249489 0.225862 0.225876 0.218555 0.218446 0.219760 0.219747 0.219781 0.219788
chargesum: 0.00000
title: Mulliken charges with hydrogens summed into heavy atoms:
elementType: N N C C C C C C C C C C C C C C C C C C
charge: -0.097607 -0.097687 0.234930 0.234457 0.358661 0.100516 0.101146 0.195104 0.195168 -0.155255 -0.155088 -0.116120 -0.116981 -0.137984 -0.137914 -0.318008 -0.042810 -0.042471 -0.001004 -0.001051
polarizability: 2.29568869e+02 -1.03985512e-01 2.35288973e+02 -2.90057200e+01 -1.90110442e-03 1.57273238e+02
1716.lowfreq: -0.0008 -0.0004 -0.0002 5.2724 11.2275 17.7765 35.7161 44.3568 46.6566
frequency: 35.7160 44.2561 46.6153 111.4067 138.3957 141.3711 223.8120 224.3487 244.1876 264.9102 328.5628 329.6863 400.0292 422.4169 422.7363 444.4997 499.3580 516.3160 522.6934 537.2991 571.1443 572.3364 578.3679 582.9572 614.3512 629.3942 660.4942 681.7695 713.3642 748.7183 749.5115 754.4388 763.5803 766.2996 771.0440 783.5416 811.4002 812.7681 851.1861 851.7783 867.7811 868.0631 903.3986 933.9629 934.0612 973.3488 973.5946 1013.6052 1014.2756 1023.8987 1029.0494 1095.6542 1095.9657 1114.5789 1132.8465 1144.7473 1167.0082 1167.7335 1221.5602 1243.4613 1245.9453 1269.1235 1284.5048 1317.2926 1321.7717 1350.4844 1377.7242 1396.3038 1411.3344 1418.9128 1429.0993 1457.1982 1457.4641 1482.0012 1482.3085 1539.1410 1554.0348 1581.6339 1584.3653 1601.6856 1630.8499 1631.8584 3098.0504 3124.2177 3124.2626 3135.7665 3135.8444 3152.8987 3153.3667 3167.3387 3167.5960 3205.6322 3225.7402 3225.8297 3611.5137 3611.7557
redmass: 4.9648 4.5139 5.3584 3.8418 4.6527 4.5935 4.0918 4.1506 5.1924 4.0842 6.1635 3.8361 4.5021 2.8596 2.8989 4.3363 4.4677 1.5519 1.3469 3.4996 4.0339 3.7117 2.8401 3.2045 4.6502 3.2923 3.9417 3.0576 1.3268 1.3469 1.3346 5.2719 4.1023 3.2582 3.0599 2.9831 1.6238 1.6465 1.4649 1.4854 5.2108 4.9256 1.4337 1.3800 1.3791 1.3010 1.3019 2.1789 2.0939 5.4327 2.4831 1.6125 1.5988 1.9246 1.4018 1.5043 1.0920 1.1113 2.3965 1.6420 1.6808 2.5756 2.4704 2.1916 2.1097 3.0097 2.6518 4.1328 2.4307 2.5025 1.5743 4.0026 3.8503 3.0661 2.9280 4.9773 6.5905 5.8752 6.2804 5.1090 7.0500 7.0345 1.0603 1.0852 1.0852 1.0899 1.0899 1.0952 1.0951 1.0991 1.0989 1.1145 1.0981 1.0981 1.0808 1.0809
irintensity: 0.0777 1.9110 0.8804 1.8112 0.2785 0.2114 12.2366 3.4779 0.7588 1.2352 0.0803 2.1165 0.2510 3.9091 23.1072 3.3539 0.7100 81.8444 59.0302 19.0563 0.2349 3.6821 14.3395 28.3051 2.1851 0.0085 0.1274 6.3632 5.3458 148.6422 58.2165 4.9877 4.3366 17.0816 14.1141 4.9534 14.2671 16.6846 0.2744 0.0980 2.2817 0.1742 64.5892 4.9792 0.8508 0.0710 0.1506 14.2474 11.5534 11.3477 7.2611 46.9492 5.6292 51.1659 0.1321 2.8002 0.0163 1.4894 1.2143 26.7028 7.3736 1.9868 1.7730 9.4604 0.3071 32.5217 61.2816 30.6913 1.3215 12.7343 0.0540 21.8812 20.2125 2.0605 4.7527 1.9033 80.6524 7.0409 0.1529 65.8354 3.3857 0.5398 5.4756 1.0107 0.2448 25.3345 4.1852 46.7943 20.7315 18.9840 20.1930 23.1106 0.1357 0.1003 112.3429 21.2567
temp: 298.150 k
press: 1.00000 atm
elementType: 7 7 6 6 6 6 6 6 6 6 6 6 6 6 6 6 6 6 6 6 1 1 1 1 1 1 1 1 1 1 1 1 1 1
symmnumber: 1
zpe: 706098.8 jmol-1
zpe.correction: 0.268939 hartree
zpe.thermalcorrener: 0.284217 hartree
zpe.thermalcorrenthalpy: 0.285161 hartree
zpe.thermalcorrgfe: 0.226004 hartree
zpe.sumelectzpe: -802.471865 hartree
zpe.sumelectthermal: -802.456586 hartree
zpe.sumelectthermalent: -802.455642 hartree
zpe.sumelectthermalfe: -802.514800 hartree
dipole: -0.0057 0.6486 -0.0060
dipole: 0.6486
quadrupole: -90.2416 -111.8318 -109.1565
quadrupole: -0.0407 -20.6822 -0.0034
quadrupole: 13.5017 -8.0885 -5.4132 -0.0407 -20.6822 -0.0034
hfenergy: -802.7408036 hartree
pointgroup: C01 [X(C18H14N2)]
dipole: -0.001256 0.0043752 0.2551411 debye
polarizability: 204.2371746|45.0638557|182.6044091|-0.40716|0.2725667|235.2894963 unknown
InChI: InChI=1S/C18H14N2/c1-12(15-10-19-17-8-4-2-6-13(15)17)16-11-20-18-9-5-3-7-14(16)18/h2-11,19-20H,1H2
charge 0 multiplicity 1
34 atoms
N  -2.66639 -2.246884 0.856225
N  2.672282 2.270278 0.771078
C  -1.060432 -0.685966 1.339609
C  1.077245 0.716604 1.310582
C  0.013346 0.023226 2.074072
C  -1.756392 -0.281242 0.120341
C  1.761128 0.283984 0.094163
C  -2.760485 -1.277144 -0.151986
C  2.758447 1.276253 -0.21399
C  -1.649122 -1.889903 1.746619
C  1.666205 1.932018 1.68134
C  -1.651747 0.83316 -0.754134
C  1.651297 -0.852506 -0.750847
C  -3.638845 -1.196156 -1.254698
C  3.624913 1.170913 -1.324022
C  0.022062 0.03871 3.447423
C  -2.523532 0.921963 -1.856226
C  2.511465 -0.965785 -1.859816
C  -3.506291 -0.08114 -2.106459
C  3.487383 0.034399 -2.146057
H  -1.383877 -2.524617 2.59002
H  1.408136 2.586497 2.511756
H  -3.232116 -3.090224 0.916335
H  3.235809 3.116566 0.8040
H  -0.89759 1.605555 -0.575829
H  0.902308 -1.623072 -0.544892
H  -4.396956 -1.964245 -1.445269
H  4.377915 1.936694 -1.542137
H  0.862644 0.46405 4.006127
H  -0.81125 -0.373796 4.026305
H  -2.446344 1.775159 -2.539328
H  2.430265 -1.836224 -2.520334
H  -4.168387 0.016945 -2.974072
H  4.140307 -0.083069 -3.018198
