program: Gaussian 09
title: 000273800
version: EM64L-G09RevD.01
frameworkgroup: C1[X(C12H13NO2)]
method: RPBEPBE
basis: SDD
operation: Freq
keyword: #p
keyword: freq=noraman
keyword: PBEPBE/SDD
title: #p freq=noraman PBEPBE/SDD
converged: YES YES NO NO
title: Mulliken charges:
elementType: O O N C C C C C C C C C C C C H H H H H H H H H H H H H
charge: -0.410453 -0.250595 -0.417821 -0.215155 0.395886 0.089806 -0.466610 0.238757 -0.425590 -0.733239 -0.402088 -0.356709 0.195660 -0.272743 -0.216815 0.247462 0.232757 0.244305 0.263066 0.216019 0.203213 0.234537 0.302338 0.261712 0.225266 0.221161 0.219850 0.376023
chargesum: 0.00000
title: Mulliken charges with hydrogens summed into heavy atoms:
elementType: O O N C C C C C C C C C C C C
charge: -0.034430 -0.250595 -0.115483 0.032307 0.395886 0.089806 0.010453 0.238757 -0.162524 -0.079470 -0.140375 -0.131443 0.195660 -0.051583 0.003035
polarizability: 1.60623757e+02 -2.30265797e+01 1.49243536e+02 8.78959315e+00 2.03107094e+01 1.02228929e+02
1716.lowfreq: -0.0005 -0.0004 0.0007 2.6674 6.3254 13.1631 24.1010 28.7455 72.1074
frequency: 23.8944 28.7219 72.1014 106.2614 139.4117 155.5900 214.5189 236.0648 243.1237 268.2314 363.2083 382.9847 422.0726 441.1536 468.6067 506.7232 530.1600 554.6054 574.7614 579.2435 606.4240 646.9374 666.8654 698.2015 749.7071 758.5859 766.4052 798.9436 851.8785 854.3755 867.7563 895.2979 924.7783 935.3212 973.1543 1002.7897 1013.3036 1035.0946 1073.7988 1091.0826 1103.3864 1116.2751 1137.5584 1168.5618 1181.8371 1237.2823 1249.2487 1261.3999 1292.5574 1298.8699 1309.6555 1350.2102 1364.2792 1388.1340 1396.6187 1422.3415 1442.0140 1459.3551 1475.0620 1482.4486 1483.7531 1555.4698 1584.3707 1630.7038 1655.6097 2977.2686 2991.5828 2999.3577 3066.9384 3087.6177 3090.3323 3122.7200 3134.0748 3148.7355 3163.1115 3224.1336 3503.7346 3612.4155
redmass: 6.7762 4.8299 8.1105 3.2846 3.7575 5.3638 4.1102 3.8040 1.1493 2.3728 3.9306 3.6926 2.9613 3.5945 4.0138 1.2522 2.6961 4.6777 3.0616 3.5329 2.5402 2.6238 2.0148 3.3145 1.3263 4.6668 3.9093 1.5123 1.6645 2.5686 4.9848 2.1849 2.0961 1.3788 1.2995 3.0031 2.0933 1.8589 1.8593 2.6563 1.7845 2.1515 1.4776 1.1066 1.2193 2.2884 1.5457 1.4812 1.4809 2.2301 1.6455 1.6887 1.7407 1.3881 2.9675 2.3196 1.1178 3.7564 1.0510 2.0277 1.2875 5.5882 6.0573 6.7586 8.3288 1.0364 1.0642 1.0836 1.0990 1.0997 1.0967 1.0852 1.0894 1.0949 1.0999 1.0973 1.0637 1.0809
irintensity: 1.9049 0.1357 2.8096 2.6003 0.7488 0.4124 8.3780 0.7298 0.2516 0.3119 4.7213 2.1368 7.9099 5.6504 6.5854 80.9616 47.4940 14.1293 11.5704 5.8560 41.3892 3.1245 81.6781 35.4135 115.1092 6.6481 6.6082 11.0091 1.3368 0.8023 1.0779 19.5402 3.8154 3.8984 0.5128 24.1891 10.0805 64.5605 147.4751 10.6147 21.9806 60.2003 3.2442 2.1334 3.4864 16.8164 4.5448 0.9719 11.9047 3.3387 3.6015 50.1082 20.7465 30.4063 14.7344 4.2920 15.3171 21.9161 13.8792 2.4945 6.5628 5.5314 0.7356 2.1399 176.3936 31.9386 22.1812 4.2327 36.2081 34.4445 15.9278 0.3394 15.5136 23.8479 24.0655 1.6989 19.3812 56.1190
temp: 298.150 k
press: 1.00000 atm
elementType: 8 8 7 6 6 6 6 6 6 6 6 6 6 6 6 1 1 1 1 1 1 1 1 1 1 1 1 1
symmnumber: 1
zpe: 590304.3 jmol-1
zpe.correction: 0.224835 hartree
zpe.thermalcorrener: 0.238371 hartree
zpe.thermalcorrenthalpy: 0.239315 hartree
zpe.thermalcorrgfe: 0.183283 hartree
zpe.sumelectzpe: -669.209672 hartree
zpe.sumelectthermal: -669.196136 hartree
zpe.sumelectthermalent: -669.195192 hartree
zpe.sumelectthermalfe: -669.251224 hartree
dipole: 0.1590 2.6759 1.9987
dipole: 3.3437
quadrupole: -80.3142 -78.5309 -89.4072
quadrupole: -0.1020 3.9546 1.5596
quadrupole: 2.4366 4.2199 -6.6564 -0.1020 3.9546 1.5596
hfenergy: -669.4345073 hartree
pointgroup: C01 [X(C12H13N1O2)]
dipole: -0.0431784 -0.9952468 -0.8591798 debye
polarizability: 157.2673825|26.5980542|146.6470245|-14.3774739|19.9294724|108.1818144 unknown
InChI: InChI=1S/C12H13NO2/c1-8(6-12(14)15)10-7-13-11-5-3-2-4-9(10)11/h2-5,7-8,13-14H,6H2,1H3
charge 0 multiplicity 1
28 atoms
O  -2.481295 1.845987 -1.248367
O  -2.024538 2.104368 1.010162
N  1.331929 -1.845903 -1.201764
C  -1.599987 -0.917815 0.969005
C  -0.293415 -1.056582 0.206637
C  0.847016 -0.149909 0.249626
C  -2.670043 -0.119446 0.151184
C  1.851279 -0.673981 -0.641116
C  0.045714 -2.073354 -0.689097
C  -2.190267 -2.287722 1.383217
C  1.123884 1.04984 0.961747
C  3.101979 -0.045581 -0.833136
C  -2.351085 1.35821 0.058347
C  2.36986 1.678381 0.777046
C  3.348891 1.138737 -0.110528
H  -1.403005 -0.333557 1.889349
H  -3.645297 -0.202928 0.671971
H  -2.784124 -0.539982 -0.860792
H  -0.524018 -2.949133 -0.99415
H  -3.095903 -2.154697 2.003447
H  -2.475995 -2.889099 0.499415
H  -1.453525 -2.868549 1.96487
H  1.815611 -2.447588 -1.864196
H  0.375295 1.48579 1.63194
H  3.855192 -0.458017 -1.51419
H  2.594927 2.602592 1.320869
H  4.30801 1.654797 -0.232068
H  -2.25719 2.817038 -1.255727
