program: Gaussian 09
title: 000273806
version: EM64L-G09RevD.01
frameworkgroup: C1[X(C17H17NO)]
method: RPBEPBE
basis: SDD
operation: Freq
keyword: #p
keyword: freq=noraman
keyword: PBEPBE/SDD
title: #p freq=noraman PBEPBE/SDD
converged: NO YES NO NO
title: Mulliken charges:
elementType: O N C C C C C C C C C C C C C C C C C H H H H H H H H H H H H H H H H H
charge: -0.241722 -0.463912 -0.358543 -0.259375 -0.508866 -0.467049 -0.467832 0.393837 0.008190 -0.474726 0.191133 0.155092 0.233017 0.211267 -0.405409 -0.800607 -0.358783 -0.255370 -0.219266 0.252811 0.257389 0.244203 0.220257 0.230424 0.227858 0.234355 0.239403 0.217609 0.305685 0.232397 0.241467 0.309356 0.201420 0.230455 0.221298 0.222535
chargesum: 0.00000
title: Mulliken charges with hydrogens summed into heavy atoms:
elementType: O N C C C C C C C C C C C C C C C C C
charge: -0.241722 -0.158227 -0.105732 -0.001985 -0.044407 -0.008767 0.005926 0.393837 0.008190 -0.257117 0.191133 0.155092 0.233017 0.211267 -0.173012 -0.048363 -0.128328 -0.034072 0.003269
polarizability: 3.16911201e+02 -9.12349838e+00 1.94552363e+02 6.01805676e+00 3.42923937e+00 1.14582808e+02
1716.lowfreq: -15.0501 -0.0006 0.0005 0.0005 0.9755 8.5797 29.9016 53.3737 78.2792
frequency: 28.1352 53.2882 78.2496 114.3859 148.3274 160.0912 184.5265 200.3749 220.4525 245.0398 266.6009 300.2526 313.1110 386.2722 411.8327 432.5771 442.0389 484.9370 495.4144 514.9733 546.6704 562.5067 576.4403 615.5746 648.4912 660.9251 672.4329 708.8479 749.8727 753.8196 767.2810 799.3794 806.9681 822.4174 851.8166 855.0047 874.4178 881.2457 893.1654 922.2979 929.6581 931.4792 948.5939 962.6257 970.8391 990.7547 1005.9973 1016.1999 1034.1014 1041.9490 1048.5643 1082.5518 1109.1737 1132.1725 1142.0073 1161.9160 1167.0793 1175.6044 1203.7035 1209.0113 1234.1746 1250.3980 1257.0513 1268.2414 1269.9332 1294.3434 1298.3199 1307.1469 1316.3003 1374.2654 1398.7350 1415.0868 1432.3785 1442.9972 1465.9821 1467.5841 1471.0636 1477.8148 1482.2379 1488.3067 1543.7859 1583.0791 1594.0457 1630.1746 1646.7007 2966.2033 3001.0051 3007.9295 3016.0846 3042.6734 3050.0795 3063.0081 3071.3813 3077.9834 3078.8661 3086.4517 3101.3681 3125.0569 3132.8922 3146.1533 3163.8315 3595.3068
redmass: 4.0062 4.5771 4.1610 4.5146 5.1738 3.7960 2.7982 1.3395 2.5106 2.9188 3.6178 3.4371 3.6106 3.2644 3.3912 2.9234 2.8799 5.5161 3.9556 3.6149 4.6027 1.1822 3.5324 5.9508 4.0730 4.9604 5.0704 5.4355 1.3829 4.4933 3.5594 2.6766 4.0839 1.7009 1.9619 2.3302 2.7311 2.4343 2.5425 2.7488 1.8404 1.5331 2.3617 1.9313 1.3071 1.6332 1.8936 1.9597 1.9437 1.4878 1.5980 1.5380 1.7400 1.4159 1.8573 1.4589 1.3177 1.5588 2.1613 1.2593 1.6928 1.9416 1.5822 1.4612 1.6924 1.5465 1.4844 2.8153 1.7171 1.6891 1.3773 2.9348 1.7857 1.4197 3.2246 1.1118 1.0919 1.3918 2.3169 1.1526 5.7078 7.2844 6.6279 6.9766 8.7696 1.0377 1.0602 1.0595 1.0627 1.0861 1.0949 1.1032 1.0907 1.1051 1.1001 1.1051 1.0911 1.0848 1.0892 1.0952 1.1002 1.0803
irintensity: 0.5513 2.6489 1.6757 1.2277 1.5105 2.9585 2.5070 1.7037 1.5871 2.6750 1.0091 1.6426 2.7716 4.9735 0.4371 5.6676 2.9977 0.2438 33.8284 5.1669 2.1516 83.2283 5.6995 1.8110 20.4397 3.6082 2.7412 11.9531 94.8980 41.4238 19.2930 2.6465 0.9436 4.6892 1.5194 2.9726 13.5192 7.0310 16.5879 39.6719 9.7327 2.1035 27.9763 13.3739 0.0440 3.6428 38.0706 2.7767 9.1204 6.9644 9.2811 54.9806 5.4264 7.9153 4.7259 2.7726 2.9004 6.2719 28.9210 1.5236 25.0639 25.3657 22.2838 0.6265 5.2628 2.2969 6.2407 25.2610 2.0882 220.9584 14.5496 24.3155 31.8881 11.8021 56.2062 3.3173 12.6378 4.5729 94.4136 6.5563 110.3262 151.6643 49.8666 2.6778 210.7183 30.4403 26.3550 48.2231 81.5291 10.8341 7.4945 2.7265 45.0368 30.3764 16.5756 69.6209 32.5151 1.6266 4.0813 33.2746 34.5162 63.2840
temp: 298.150 k
press: 1.00000 atm
elementType: 8 7 6 6 6 6 6 6 6 6 6 6 6 6 6 6 6 6 6 1 1 1 1 1 1 1 1 1 1 1 1 1 1 1 1 1
symmnumber: 1
zpe: 776680.6 jmol-1
zpe.correction: 0.295822 hartree
zpe.thermalcorrener: 0.311281 hartree
zpe.thermalcorrenthalpy: 0.312225 hartree
zpe.thermalcorrgfe: 0.252963 hartree
zpe.sumelectzpe: -786.638271 hartree
zpe.sumelectthermal: -786.622813 hartree
zpe.sumelectthermalent: -786.621868 hartree
zpe.sumelectthermalfe: -786.681131 hartree
dipole: 0.5438 0.2337 -1.9191
dipole: 2.0083
quadrupole: -96.1825 -99.8878 -118.2337
quadrupole: 11.3961 4.8249 -3.0355
quadrupole: 8.5855 4.8802 -13.4657 11.3961 4.8249 -3.0355
hfenergy: -786.9340932 hartree
pointgroup: C01 [X(C17H17N1O1)]
dipole: -0.2012288 0.4084953 0.6457017 debye
polarizability: 314.0664215|19.1188295|177.6323161|-8.8204631|-35.6936747|134.3476351 unknown
InChI: InChI=1S/C17H17NO/c1-10-14(13-4-2-3-5-16(13)18-10)9-15-11-6-7-12(8-11)17(15)19/h2-5,9,11-12,18H,6-8H2,1H3
charge 0 multiplicity 1
36 atoms
O  1.649923 1.046132 -1.974364
N  -2.5590 1.472041 -0.614898
C  3.039035 -0.256148 1.131258
C  3.830107 0.577738 -0.840196
C  4.062914 0.830543 0.675131
C  3.617712 -1.530256 0.419672
C  4.142419 -0.959723 -0.949052
C  1.780122 0.187017 0.368767
C  2.291046 0.701097 -0.93553
C  0.493071 -0.070348 0.797831
C  -0.798492 0.328263 0.280338
C  -2.02398 -0.44944 0.484458
C  -1.181715 1.519983 -0.388157
C  -3.106948 0.284557 -0.102621
C  -2.295421 -1.704527 1.083846
C  -0.391753 2.73365 -0.754675
C  -4.435562 -0.185317 -0.105318
C  -3.622969 -2.181871 1.097533
C  -4.681644 -1.432569 0.508823
H  2.894156 -0.371701 2.216911
H  4.360027 1.205796 -1.57051
H  3.791617 1.850218 1.00023
H  5.096982 0.605607 0.994368
H  2.846741 -2.308336 0.286488
H  4.440986 -1.964523 1.016099
H  5.231186 -1.112214 -1.059241
H  3.64734 -1.416291 -1.822956
H  0.424133 -0.709948 1.694844
H  -3.087506 2.219935 -1.060808
H  -1.490295 -2.303777 1.52352
H  0.36562 2.947467 0.020721
H  0.174429 2.554999 -1.68884
H  -1.038218 3.622545 -0.870051
H  -5.249436 0.386636 -0.564723
H  -3.846758 -3.148517 1.562238
H  -5.701474 -1.832316 0.529169
