program: Gaussian 09
title: 000273929
version: EM64L-G09RevD.01
frameworkgroup: C1[X(C22H22N2O8)]
method: RPBEPBE
basis: SDD
operation: Freq
keyword: #p
keyword: freq=noraman
keyword: PBEPBE/SDD
title: #p freq=noraman PBEPBE/SDD
converged: YES YES NO NO
title: Mulliken charges:
elementType: O O O O O O O O N N C C C C C C C C C C C C C C C C C C C C C C H H H H H H H H H H H H H H H H H H H H H H
charge: -0.304682 -0.308482 -0.252898 -0.242438 -0.197744 -0.199816 -0.199731 -0.199879 0.028245 0.027671 -0.110681 0.026558 -0.417768 -0.462670 -0.388259 -0.406159 -0.420865 -0.374415 0.240908 0.195706 0.235398 0.228057 -0.320328 -0.320728 -0.312486 -0.308813 -0.352158 -0.355741 -0.345445 -0.357454 0.388684 0.388765 0.276066 0.264476 0.208697 0.231501 0.235595 0.222044 0.205335 0.208169 0.218624 0.200489 0.199475 0.209263 0.207675 0.202131 0.280441 0.281243 0.279263 0.302174 0.292856 0.291878 0.290552 0.291700
chargesum: 0.00000
title: Mulliken charges with hydrogens summed into heavy atoms:
elementType: O O O O O O O O N N C C C C C C C C C C C C C C C C C C C C C C
charge: -0.304682 -0.308482 -0.252898 -0.242438 -0.197744 -0.199816 -0.199731 -0.199879 0.028245 0.027671 0.165386 0.291034 0.022430 -0.005031 0.025245 0.012955 -0.012127 0.035391 0.240908 0.195706 0.235398 0.228057 -0.039887 -0.039485 -0.033223 -0.006639 -0.059301 -0.063863 -0.054893 -0.065754 0.388684 0.388765
polarizability: 3.80110421e+02 -2.19485002e+00 2.49178011e+02 -1.73264827e+01 -1.36014649e+01 2.44304821e+02
1716.lowfreq: -4.5293 -2.4606 -0.0005 -0.0004 0.0002 5.4033 8.9645 18.6603 19.8648
frequency: 8.8879 18.6229 19.7966 31.3617 34.0240 40.1488 51.8384 59.4596 67.6179 78.0489 82.0572 87.9558 93.5774 95.1819 141.6635 171.4488 178.0364 198.3501 215.6879 222.8017 239.6474 250.5958 272.0091 275.5290 281.0444 289.5988 320.7135 324.0385 351.3860 385.3261 410.0691 410.6445 419.8743 431.2820 457.6888 459.6547 477.7036 480.8003 488.5296 492.2946 511.0289 517.1983 555.2053 602.9969 623.5451 623.9146 650.6135 652.6289 672.8865 683.0912 684.4198 686.7392 716.0663 762.7182 765.1019 767.1241 771.2197 780.0304 789.9738 806.4366 824.2667 833.8978 858.6320 864.3232 867.5508 868.8426 888.8490 890.8480 908.0618 928.2373 953.9621 1002.9750 1004.7352 1004.9906 1007.5919 1010.9769 1011.9697 1013.7807 1026.5518 1034.2655 1056.4592 1070.3205 1088.5624 1089.3725 1103.4992 1107.0771 1110.3798 1115.0630 1119.9999 1125.4889 1158.8254 1173.3732 1178.9979 1209.1142 1211.5984 1215.7184 1219.0448 1236.6159 1244.3534 1247.8460 1252.7788 1270.8398 1290.2377 1294.5680 1298.6781 1312.1662 1323.5145 1328.4058 1343.9332 1348.8282 1352.3103 1355.2290 1367.7984 1368.8292 1369.1056 1385.6123 1404.5880 1405.0298 1414.2818 1414.6620 1456.9080 1462.1308 1466.5919 1473.6192 1475.2599 1479.1966 1484.6189 1491.2566 1588.6493 1589.6839 1609.0170 1609.5388 1618.6994 1621.2667 2958.2532 2977.3023 2983.6034 2984.7623 2994.5756 3002.7826 3018.6273 3028.7393 3030.6566 3034.8879 3039.0258 3046.2239 3054.5861 3061.7929 3164.1135 3164.3710 3170.9985 3176.3916 3187.6708 3188.2859 3190.4889 3193.9361
redmass: 11.0440 5.9878 7.3572 6.0350 4.7660 6.5136 6.4829 8.7922 6.1393 5.3554 7.6662 9.9229 5.1438 6.9236 5.2232 3.0096 5.7501 5.0275 2.4029 4.2437 6.7086 6.1873 5.6125 4.6064 6.2880 5.1594 6.6662 2.5407 3.5458 4.3456 2.8916 2.8866 4.5160 3.2455 3.9955 3.7517 1.6758 5.6078 8.0012 5.4928 5.4371 6.1467 3.6161 4.6673 7.1132 7.0850 6.2625 6.2830 7.3058 3.9042 7.7446 4.0525 2.3312 5.0484 5.0395 4.7361 2.9587 3.0261 2.6313 5.5525 5.2705 2.8205 2.3249 1.2452 1.2835 1.9590 1.6711 1.6579 5.0178 2.1364 2.0025 3.2947 3.0221 1.3521 1.3742 2.1620 1.3812 1.3912 2.4644 2.2833 4.6115 5.1095 3.1761 3.2520 1.5875 1.3244 1.3352 1.9158 2.4229 2.4389 1.6835 1.2184 1.2609 2.8455 1.6623 4.9412 1.2919 2.8690 1.3701 2.3578 1.6337 1.1822 1.2643 1.2630 1.3591 1.3554 1.1677 1.3607 1.4238 1.3449 1.4023 1.4249 7.8574 6.4360 1.4287 1.5007 7.7728 8.7526 4.2995 4.7881 1.0833 1.0854 1.0871 2.4471 2.4101 1.0815 1.0763 1.0850 8.8736 9.0561 6.5435 6.4414 9.9574 10.5826 1.0621 1.0638 1.0627 1.0615 1.0628 1.0649 1.0950 1.1010 1.0896 1.0936 1.0980 1.0926 1.0988 1.0975 1.0902 1.0901 1.0903 1.0890 1.0956 1.0957 1.0971 1.0973
irintensity: 0.0629 0.0679 0.0877 0.0743 0.0220 0.1016 0.0324 0.4909 0.1931 0.0646 1.5637 4.6436 1.1566 7.0169 0.0639 2.2745 2.2583 4.7418 1.6325 6.1594 1.3345 0.1892 0.5891 2.3785 2.0713 7.9562 6.9676 3.4095 0.4515 3.2630 0.0707 0.0464 19.6701 0.5464 0.6026 0.5537 5.1708 5.0667 4.3298 5.0925 1.4169 2.2872 0.0455 1.1438 0.0487 0.6382 0.6492 0.4667 2.0389 78.1830 6.8300 39.4595 15.4230 4.3543 15.8905 11.8389 20.0853 10.5275 9.9727 21.0271 7.8118 11.1913 3.1160 0.3633 1.5735 16.9120 62.5381 42.8002 62.1966 33.8915 21.5284 38.7890 41.5687 0.4782 2.5587 2.7691 0.4921 2.1818 45.8942 14.0422 166.4847 379.3183 8.5363 11.4930 15.1420 13.8534 10.0433 3.5524 13.1575 2.2685 1.0941 3.7538 6.9759 261.8266 112.1144 558.7539 26.8315 71.3093 16.2114 175.6807 128.7794 0.1211 0.0459 0.9416 26.4892 9.0513 13.3019 3.7318 0.9868 0.2043 1.7428 1.8751 67.0149 86.0552 8.4335 1.2613 11.2887 6.8137 59.8250 68.3188 11.2807 8.9579 8.9149 4.2181 3.3423 10.7519 5.0489 26.4088 48.3547 46.1145 2.3073 4.7948 43.7130 181.7938 36.5141 17.8900 11.6244 17.6008 23.7507 22.1972 54.0241 3.1811 32.1426 32.1552 100.9202 33.6212 20.1461 41.1715 1.1643 1.1557 2.4172 1.2543 1.1080 0.6968 0.7888 0.6864
temp: 298.150 k
press: 1.00000 atm
elementType: 8 8 8 8 8 8 8 8 7 7 6 6 6 6 6 6 6 6 6 6 6 6 6 6 6 6 6 6 6 6 6 6 1 1 1 1 1 1 1 1 1 1 1 1 1 1 1 1 1 1 1 1 1 1
symmnumber: 1
zpe: 1082051.4 jmol-1
zpe.correction: 0.412132 hartree
zpe.thermalcorrener: 0.441028 hartree
zpe.thermalcorrenthalpy: 0.441973 hartree
zpe.thermalcorrgfe: 0.347414 hartree
zpe.sumelectzpe: -1560.355340 hartree
zpe.sumelectthermal: -1560.326443 hartree
zpe.sumelectthermalent: -1560.325499 hartree
zpe.sumelectthermalfe: -1560.420058 hartree
dipole: 9.6593 -0.1847 0.9699
dipole: 9.7096
quadrupole: -204.6008 -214.3783 -190.1997
quadrupole: 1.3693 -0.1085 8.0534
quadrupole: -1.5412 -11.3187 12.8599 1.3693 -0.1085 8.0534
hfenergy: -1560.7674719 hartree
pointgroup: C01 [X(C22H22N2O8)]
dipole: -0.7397716 -3.7407027 -0.2297965 debye
polarizability: 249.6399264|21.8453163|374.946337|-17.8587342|-19.1947068|249.0069893 unknown
InChI: InChI=1S/C22H22N2O8/c25-21(15-7-11-17(12-8-15)23(27)28)31-19-5-3-1-2-4-6-20(19)32-22(26)16-9-13-18(14-10-16)24(29)30/h7-14,19-20H,1-6H2
charge 0 multiplicity 1
54 atoms
O  -1.671051 -1.4864 -0.39486
O  1.050107 -1.767208 -0.376569
O  -1.030271 -0.336899 -2.332121
O  1.976108 -1.838614 1.766427
O  -3.94714 5.428389 0.494486
O  5.605419 3.957198 0.005587
O  -4.469936 4.234467 2.366632
O  4.517372 4.016677 -1.998301
N  -3.958273 4.339847 1.186715
N  4.757253 3.48761 -0.846083
C  -1.059494 -2.766795 -0.904713
C  0.219853 -2.983383 -0.081329
C  -2.14906 -3.842551 -0.752452
C  1.071437 -4.217092 -0.440701
C  -2.464547 -4.295155 0.70349
C  0.462657 -5.612503 -0.127067
C  -1.836155 -5.64478 1.141279
C  -0.288905 -5.741392 1.230607
C  -1.567337 -0.351774 -1.197743
C  1.872466 -1.291343 0.640598
C  -2.193412 0.842847 -0.54552
C  2.603439 -0.055601 0.218304
C  -2.201855 2.064014 -1.268752
C  3.539261 0.503134 1.127045
C  -2.766286 0.777028 0.751228
C  2.373465 0.555846 -1.042801
C  -2.777957 3.217462 -0.706835
C  4.251469 1.666263 0.784918
C  -3.346147 1.923568 1.325608
C  3.079783 1.721302 -1.395556
C  -3.342497 3.125455 0.58449
C  4.008106 2.25587 -0.475369
H  -0.799035 -2.604386 -1.96737
H  -0.004665 -2.969153 0.999882
H  -1.874478 -4.716561 -1.371273
H  -3.057642 -3.417717 -1.218315
H  2.007324 -4.112448 0.14003
H  1.350854 -4.160956 -1.510689
H  -3.562033 -4.402759 0.800261
H  -2.184513 -3.493606 1.415286
H  1.307819 -6.326969 -0.143066
H  -0.209107 -5.935799 -0.944257
H  -2.190826 -6.434752 0.445997
H  -2.252583 -5.902803 2.135978
H  0.101478 -4.999813 1.956526
H  -0.055569 -6.732154 1.666565
H  -1.755014 2.086144 -2.267385
H  3.690815 0.012005 2.093182
H  -2.750542 -0.170452 1.294861
H  1.644863 0.117386 -1.73032
H  -2.800479 4.171859 -1.23862
H  4.979345 2.120843 1.461405
H  -3.795382 1.907115 2.321644
H  2.927202 2.21809 -2.356863
