program: Gaussian 09
title: 000273786
version: EM64L-G09RevD.01
frameworkgroup: C1[X(C18H15NO)]
method: RPBEPBE
basis: SDD
operation: Freq
keyword: #p
keyword: freq=noraman
keyword: PBEPBE/SDD
title: #p freq=noraman PBEPBE/SDD
converged: YES YES NO NO
title: Mulliken charges:
elementType: O N C C C C C C C C C C C C C C C C C C H H H H H H H H H H H H H H H
charge: -0.270113 -0.467796 0.159358 0.206484 0.204385 0.206006 -0.347436 -0.369524 -0.263852 -0.786367 -0.275659 -0.215509 -0.324110 0.088761 0.289052 -0.347301 -0.357098 -0.252115 -0.236551 -0.232573 0.308520 0.219463 0.232442 0.258658 0.261668 0.261292 0.218510 0.224250 0.225954 0.201458 0.216393 0.279702 0.225811 0.228732 0.229104
chargesum: 0.00000
title: Mulliken charges with hydrogens summed into heavy atoms:
elementType: O N C C C C C C C C C C C C C C C C C C
charge: -0.270113 -0.159276 0.159358 0.206484 0.204385 0.206006 -0.127973 -0.137083 -0.005194 -0.044896 -0.051409 0.010445 -0.122652 0.088761 0.289052 -0.130909 -0.077396 -0.026304 -0.007819 -0.003469
polarizability: 3.90462553e+02 -1.43892320e-01 2.46378884e+02 2.59337572e+00 -1.99609663e+00 8.37410351e+01
1716.lowfreq: -40.6040 -6.7069 -0.0006 -0.0004 -0.0003 1.7751 6.6809 15.3931 28.2745
frequency: -40.5829 14.9409 28.2605 43.1620 73.5678 105.3690 137.9053 144.1421 184.0986 188.9626 220.1388 279.1450 282.2485 301.2731 381.1178 387.6278 401.3885 435.0680 442.8815 464.3993 484.0344 565.6184 566.3002 569.5942 578.3779 614.2300 647.3978 650.5476 659.4201 689.7043 698.3440 732.3149 749.5901 765.7124 793.8762 828.4640 845.8022 853.2590 864.2161 868.8974 932.5341 939.3958 955.3936 974.0734 986.4852 989.4699 1002.2013 1003.1176 1010.2176 1015.6333 1028.1046 1035.6696 1042.9776 1084.8385 1099.2840 1147.9972 1170.6094 1176.3921 1187.4417 1220.2936 1237.0337 1248.9865 1291.4477 1302.2730 1317.9034 1340.6384 1362.0976 1384.8225 1403.1874 1414.0999 1431.5500 1441.8435 1460.1307 1466.8098 1478.9560 1480.8896 1488.0956 1509.6095 1536.1216 1587.0912 1588.8285 1607.8693 1631.9137 1634.1753 2986.2557 3069.1502 3082.6019 3086.6602 3124.5492 3128.7976 3134.9539 3139.4784 3148.1453 3157.1183 3158.0581 3166.9750 3171.9314 3186.0834 3593.5570
redmass: 1.0544 3.8626 4.7049 5.1985 5.6233 3.5589 3.6149 5.1511 5.0053 4.3206 2.9324 5.6888 3.6446 4.0507 3.4799 6.1612 2.8209 2.9491 3.8588 5.1221 5.4442 4.6473 4.9171 1.1777 3.4684 6.4211 6.3136 3.5616 5.6391 3.9073 1.5757 5.6062 1.3913 3.1991 2.1163 4.8652 1.6125 1.3220 5.2275 1.7590 1.4026 1.4600 3.2082 1.3149 1.3981 5.6951 1.2592 1.9352 1.3390 2.8238 2.0594 1.4779 2.2512 1.6686 2.4449 1.6318 1.0697 1.2310 1.1334 1.9552 1.3924 2.5132 2.2231 1.4580 1.8495 1.5549 2.3607 9.0540 1.7608 2.0798 2.3263 2.7475 1.0440 3.5297 2.3517 2.1484 1.6764 7.6406 5.0133 6.2957 6.1684 6.0127 7.0716 6.0331 1.0371 1.0980 1.0958 1.0909 1.0847 1.0858 1.0882 1.0903 1.0926 1.0955 1.0953 1.1005 1.0977 1.0890 1.0805
irintensity: 0.7135 0.8627 3.4734 0.8288 0.2905 0.0371 4.4005 0.9393 1.2068 0.1478 0.0259 11.4657 1.2505 1.1050 2.9842 0.1577 0.2383 5.4569 1.9704 2.5187 0.0986 11.1189 39.0659 80.9825 3.4324 0.6805 21.8352 1.2252 3.7567 1.9937 100.7699 10.5019 72.6345 0.7507 51.7831 6.3696 11.1883 1.4028 0.1425 10.4712 2.7462 1.2417 21.6301 0.3249 2.7283 0.5860 32.3203 57.1709 4.5800 28.3689 4.5036 3.0745 34.1784 12.5719 1.1053 7.3374 10.4235 6.4488 30.9328 123.0954 15.9904 25.5604 180.0417 245.4361 121.2972 65.6334 128.9053 3.2019 12.3225 35.2204 4.9452 4.9598 16.6485 87.8485 1.3857 9.6874 85.7373 285.9126 18.7827 61.2481 11.7535 47.3320 4.3222 568.1845 26.8438 7.6877 19.4480 3.5909 1.0858 0.9441 9.9739 12.0007 24.6061 5.8747 58.4083 32.0239 4.4714 19.1012 91.7144
temp: 298.150 k
press: 1.00000 atm
elementType: 8 7 6 6 6 6 6 6 6 6 6 6 6 6 6 6 6 6 6 6 1 1 1 1 1 1 1 1 1 1 1 1 1 1 1
symmnumber: 1
zpe: 726876.2 jmol-1
zpe.correction: 0.276853 hartree
zpe.thermalcorrener: 0.293133 hartree
zpe.thermalcorrenthalpy: 0.294077 hartree
zpe.thermalcorrgfe: 0.230698 hartree
zpe.sumelectzpe: -823.526857 hartree
zpe.sumelectthermal: -823.510576 hartree
zpe.sumelectthermalent: -823.509632 hartree
zpe.sumelectthermalfe: -823.573011 hartree
dipole: 4.9171 -0.8537 0.1480
dipole: 4.9928
quadrupole: -83.2569 -105.7828 -124.8647
quadrupole: 19.0892 0.7332 -0.2401
quadrupole: 21.3779 -1.1480 -20.2299 19.0892 0.7332 -0.2401
hfenergy: -823.8037091 hartree
pointgroup: C01 [X(C18H15N1O1)]
dipole: -1.9350883 -0.3323765 -0.0592914 debye
polarizability: 390.4827084|0.0155819|245.9967389|0.7711936|8.1219579|84.1030247 unknown
InChI: InChI=1S/C18H15NO/c1-13-15(16-9-5-6-10-17(16)19-13)11-12-18(20)14-7-3-2-4-8-14/h2-12,19H,1H3
charge 0 multiplicity 1
35 atoms
O  2.202487 2.360455 0.20044
N  -4.064556 1.1594 0.106762
C  -2.434622 -0.446996 0.092037
C  -1.796995 0.873708 0.113203
C  -3.855771 -0.231415 0.087737
C  -2.84583 1.829302 0.12274
C  -1.96293 -1.785189 0.079769
C  -4.796996 -1.279184 0.069719
C  -0.408717 1.262407 0.122704
C  -2.778056 3.330438 0.142714
C  -2.894317 -2.844578 0.061607
C  -4.296033 -2.598051 0.055934
C  0.717747 0.468552 0.0985
C  2.05813 1.089666 0.124269
C  3.28547 0.210609 0.065066
C  3.24232 -1.195962 -0.136547
C  4.552518 0.839462 0.209288
C  4.434432 -1.951106 -0.190163
C  5.742161 0.087208 0.159457
C  5.687649 -1.313851 -0.040324
H  -4.975523 1.615298 0.109086
H  -0.893023 -2.0092 0.086841
H  -5.87539 -1.085312 0.067038
H  -0.203105 2.343692 0.15316
H  -2.222456 3.694934 1.025283
H  -2.259224 3.721137 -0.75125
H  -3.785584 3.781394 0.170576
H  -2.533552 -3.878909 0.052437
H  -4.994027 -3.442105 0.041701
H  0.638863 -0.619646 0.06903
H  2.286552 -1.713623 -0.265031
H  4.565571 1.924408 0.357199
H  4.38645 -3.03409 -0.350177
H  6.710662 0.586574 0.274997
H  6.611793 -1.901628 -0.080604
