program: Gaussian 09
title: 000273794
version: EM64L-G09RevD.01
frameworkgroup: C1[X(C18H17NO2)]
method: RPBEPBE
basis: SDD
operation: Freq
keyword: #p
keyword: freq=noraman
keyword: PBEPBE/SDD
title: #p freq=noraman PBEPBE/SDD
converged: YES YES NO NO
title: Mulliken charges:
elementType: O O N C C C C C C C C C C C C C C C C C C H H H H H H H H H H H H H H H H H
charge: -0.419598 -0.232352 -0.451285 -0.334113 0.313084 0.118210 0.103206 -0.571413 0.199620 0.441904 -0.396541 -0.797201 -0.366373 -0.381008 -0.428311 0.187773 -0.276594 -0.218990 -0.230628 -0.250883 -0.247417 0.235022 0.265715 0.263379 0.299266 0.244473 0.253682 0.236065 0.239795 0.226714 0.234433 0.253033 0.219441 0.219688 0.222683 0.223186 0.226331 0.376003
chargesum: 0.00000
title: Mulliken charges with hydrogens summed into heavy atoms:
elementType: O O N C C C C C C C C C C C C C C C C C C
charge: -0.043595 -0.232352 -0.152019 -0.099090 0.313084 0.118210 0.103206 -0.042319 0.199620 0.441904 -0.152067 -0.067659 -0.139660 -0.146575 -0.175279 0.187773 -0.057153 0.000698 -0.007944 -0.027697 -0.021086
polarizability: 2.23822037e+02 6.58249242e+00 2.00586462e+02 -5.66392894e+00 -3.00447507e+01 1.78591045e+02
1716.lowfreq: -8.3016 -2.5350 -0.0006 -0.0003 -0.0001 7.3854 18.4992 27.5231 45.5777
frequency: 18.1115 27.4455 45.5768 51.9267 63.4606 69.0416 103.6625 124.3645 152.9824 164.4279 186.0862 203.6991 248.6001 290.5272 301.4547 352.8719 372.6808 404.0854 430.1591 452.5727 464.3773 484.8929 498.4252 500.8781 541.4423 570.7398 579.9804 603.5760 616.7861 619.9336 653.8796 664.3835 671.9473 704.2729 730.5561 747.9444 762.6805 771.2634 785.4706 848.1924 853.4005 854.9414 876.7402 916.9910 928.9845 941.8612 960.4278 969.3860 978.3371 989.9050 993.6812 999.1416 1017.3777 1019.0153 1035.2940 1043.2297 1063.1650 1090.1196 1104.9932 1142.4904 1169.1491 1170.6352 1173.0452 1198.6501 1201.5226 1231.5311 1242.6559 1251.2718 1278.1353 1303.3633 1310.5369 1327.3219 1343.9252 1352.2499 1379.7764 1399.8148 1414.0291 1423.6092 1436.4533 1452.0198 1464.8486 1469.4291 1473.6026 1483.4453 1486.3918 1577.1734 1590.4854 1593.9772 1614.2658 1632.8213 1662.5896 2967.7385 2979.5331 3010.3433 3035.9201 3091.2965 3095.5729 3117.1388 3122.8199 3123.8632 3133.1901 3136.6820 3146.3111 3147.5454 3161.8586 3162.9802 3502.6392 3603.5002
redmass: 4.9409 4.0212 9.8726 5.1038 5.0791 5.3127 1.1118 2.6673 5.8583 4.8328 4.0026 4.1073 3.6372 4.1934 4.1782 3.4619 5.5401 2.8359 2.8871 4.0143 2.9593 4.9407 2.1153 1.5551 3.2013 3.5908 3.1409 3.4323 5.3743 3.6522 3.6618 2.6880 2.7058 2.1320 2.2555 1.4084 3.3789 3.3016 2.7382 1.5251 3.2661 1.3855 4.9034 1.4978 1.3897 3.0484 2.0368 1.3088 1.4084 5.5731 1.3459 1.9913 3.0113 2.3836 2.0712 1.5564 2.2990 1.8974 2.0330 1.7852 1.3221 1.1462 1.0909 1.1285 2.0371 1.3723 1.8565 1.6308 1.6213 2.4110 2.0644 1.4001 1.7476 1.5993 7.0803 1.9214 2.2419 2.4515 2.2262 1.1071 3.7492 1.0701 1.2709 2.5039 2.2050 6.4668 5.9679 6.0386 5.9358 6.7836 8.4210 1.0394 1.0811 1.0642 1.0980 1.0968 1.0951 1.0853 1.0852 1.0867 1.0891 1.0920 1.0954 1.0949 1.1014 1.1000 1.0638 1.0803
irintensity: 0.5803 0.1344 1.9467 0.6447 0.6807 0.1736 0.1417 1.9675 1.9701 2.0259 0.3178 0.3088 0.2483 0.3942 0.4017 2.1213 3.7306 0.2793 6.8344 1.7895 4.5155 1.1319 31.9677 35.7081 69.8165 36.6346 21.6950 7.7037 2.9908 22.1501 21.2307 31.6791 63.3312 35.7299 53.2845 87.8521 13.2964 10.6035 12.2708 0.2312 1.3868 0.4981 3.5611 2.5949 1.9193 6.8152 13.4180 0.1700 0.1476 0.5029 0.2903 10.8771 39.9893 10.7187 22.3923 6.6388 197.6637 6.5227 1.4756 4.1858 9.4793 1.0378 1.6858 0.7425 4.6509 12.7342 28.1704 2.3258 44.7815 23.9793 6.3753 4.9212 9.8415 48.7907 1.5513 7.3695 31.7030 21.5763 14.1313 26.6571 25.1090 9.7207 11.4406 3.5711 18.4994 7.8038 0.2919 8.1692 11.5517 4.7394 196.0133 57.2170 6.1481 7.1974 18.1425 6.9725 14.8030 4.5002 1.1798 0.2559 9.5290 18.7143 31.9854 37.9921 24.7205 26.8089 19.2184 51.0657
temp: 298.150 k
press: 1.00000 atm
elementType: 8 8 7 6 6 6 6 6 6 6 6 6 6 6 6 6 6 6 6 6 6 1 1 1 1 1 1 1 1 1 1 1 1 1 1 1 1 1
symmnumber: 1
zpe: 797385.8 jmol-1
zpe.correction: 0.303708 hartree
zpe.thermalcorrener: 0.322337 hartree
zpe.thermalcorrenthalpy: 0.323281 hartree
zpe.thermalcorrgfe: 0.254639 hartree
zpe.sumelectzpe: -899.859877 hartree
zpe.sumelectthermal: -899.841248 hartree
zpe.sumelectthermalent: -899.840304 hartree
zpe.sumelectthermalfe: -899.908946 hartree
dipole: -1.7771 -1.2698 0.7605
dipole: 2.3128
quadrupole: -110.5115 -116.9829 -117.4191
quadrupole: 10.7576 -13.7786 -2.6331
quadrupole: 4.4597 -2.0117 -2.4479 10.7576 -13.7786 -2.6331
hfenergy: -900.1635854 hartree
pointgroup: C01 [X(C18H17N1O2)]
dipole: -0.6796421 -0.4948993 0.3480156 debye
polarizability: 222.2667818|3.1124254|203.4870801|-11.3399398|-28.9834288|177.2456821 unknown
InChI: InChI=1S/C18H17NO2/c1-12-18(14-9-5-6-10-16(14)19-12)15(11-17(20)21)13-7-3-2-4-8-13/h2-10,15,19-20H,11H2,1H3
charge 0 multiplicity 1
38 atoms
O  2.987216 -1.693494 -2.682258
O  3.097183 -2.644234 -0.568145
N  -2.790661 -1.339692 1.224813
C  0.776654 -0.864543 0.151169
C  -0.714259 -0.811936 0.435515
C  -1.68474 0.093531 -0.164088
C  -1.423408 -1.676518 1.280161
C  1.037218 -1.467126 -1.262288
C  -2.980752 -0.264553 0.349329
C  1.470399 0.492633 0.386945
C  -1.58923 1.175494 -1.080029
C  -0.959485 -2.813759 2.147111
C  -4.161814 0.409991 -0.027784
C  1.28298 1.13834 1.637598
C  2.306994 1.118099 -0.570832
C  2.45123 -1.992027 -1.417671
C  -2.763574 1.853068 -1.462758
C  -4.037099 1.473931 -0.945261
C  1.912525 2.366286 1.926593
C  2.938414 2.352481 -0.286067
C  2.74642 2.981788 0.962655
H  1.233062 -1.578946 0.866727
H  0.362247 -2.335285 -1.387808
H  0.802814 -0.758581 -2.072537
H  -3.523972 -1.811102 1.750119
H  -0.615617 1.492806 -1.467875
H  0.137044 -2.914341 2.106955
H  -1.24149 -2.663594 3.20742
H  -1.390722 -3.781095 1.823068
H  -5.141038 0.12419 0.373093
H  0.623586 0.674484 2.381359
H  2.479665 0.656642 -1.549162
H  -2.700993 2.691084 -2.16587
H  -4.932055 2.021242 -1.262033
H  1.751766 2.845849 2.8990
H  3.580342 2.819002 -1.042275
H  3.2355 3.937335 1.182948
H  3.902853 -2.081652 -2.746736
