program: Gaussian 09
title: 000273775
version: EM64L-G09RevD.01
frameworkgroup: C1[X(C14H18O4)]
method: RPBEPBE
basis: SDD
operation: Freq
keyword: #pfreq=noraman
keyword: PBEPBE/SDD
title: #p freq=noraman PBEPBE/SDD
converged: YES YES NO NO
title: Mulliken charges:
elementType: O O O O C C C C C C C C C C C C C C H H H H H H H H H H H H H H H H H H
charge: -0.255481 -0.255989 -0.223246 -0.261640 -0.031245 -0.025909 -0.466768 -0.421747 0.047464 -0.376085 -0.143771 0.486981 -0.331905 -0.466407 -0.509016 -0.229211 -0.225366 -0.233481 0.195218 0.188937 0.194039 0.246729 0.254810 0.219796 0.157422 0.251669 0.180140 0.191462 0.267764 0.226308 0.245155 0.193863 0.230995 0.226238 0.225323 0.226955
chargesum: 0.00000
title: Mulliken charges with hydrogens summed into heavy atoms:
elementType: O O O O C C C C C C C C C C C C C C
charge: -0.255481 -0.255989 -0.223246 -0.261640 0.163973 0.163029 -0.026001 0.052859 0.204886 0.055724 0.047691 0.486981 -0.064141 -0.240099 0.160997 -0.002973 -0.000043 -0.006526
polarizability: 1.99724313e+02 -2.23486396e+00 1.58137877e+02 -9.48638187e+00 5.57303225e-01 1.16637574e+02
1716.lowfreq: -3.1755 -0.0007 -0.0006 -0.0005 5.3780 11.4223 18.7981 29.9007 68.6478
frequency: 18.6279 29.7044 68.6152 93.2868 104.4773 138.4509 149.9942 164.2413 193.2634 229.4788 245.3177 272.2910 323.2603 345.9798 349.9858 375.5103 402.8995 411.8880 476.0161 489.7158 509.1563 524.8012 558.4798 614.7699 629.2935 658.7937 700.9362 757.4592 775.3294 794.4633 815.7528 838.6029 854.1560 866.6188 871.4181 880.7643 909.1365 921.8390 932.8133 942.3141 960.4777 977.7455 989.6394 991.1737 997.0521 1026.4291 1032.2307 1062.9022 1070.4069 1083.6893 1095.3286 1108.2235 1114.0166 1134.4307 1164.1891 1172.2470 1184.2878 1193.6138 1208.0108 1213.0507 1240.4864 1267.7057 1278.1512 1297.1602 1307.0655 1308.2519 1319.4496 1331.6017 1346.3441 1350.9241 1362.9962 1366.4914 1374.1093 1393.4224 1431.4659 1440.8675 1444.5976 1453.1386 1454.4304 1459.1449 1479.7720 1488.8321 1599.1823 1620.3725 2830.5208 2877.1637 2891.2231 2915.8039 2945.2802 2951.3070 2987.9527 3025.3751 3063.0166 3065.0467 3096.9313 3099.3224 3117.1294 3122.1591 3127.6962 3142.2455 3157.5835 3170.6718
redmass: 3.7588 5.0365 3.5239 3.4923 2.8618 4.4410 1.3963 4.3314 3.9191 3.4781 4.1296 3.3099 3.0734 2.7369 3.7635 4.4626 2.7998 3.5504 3.8424 3.7041 4.3025 3.3475 4.9756 6.2701 5.9103 3.6872 1.7800 2.1071 3.4063 3.3983 3.9881 2.8640 1.2585 3.4004 3.4011 3.6159 3.8671 3.6971 1.7079 2.6793 3.3182 1.3905 2.8893 6.2274 1.3198 2.1540 2.5434 3.5149 2.1724 1.6098 1.8912 1.9001 1.3223 2.5691 1.6784 1.0548 1.1104 1.4247 1.3818 1.7765 1.1957 1.2182 1.3415 1.2727 1.3196 1.5109 1.4225 1.2858 1.4422 1.3212 1.2935 1.8920 1.6674 4.1585 1.1754 1.2627 1.6908 1.0534 1.0795 1.1028 1.0536 2.5281 6.2367 6.1888 1.0821 1.0834 1.0804 1.0814 1.0706 1.0397 1.0658 1.0614 1.0927 1.0967 1.1029 1.0944 1.0868 1.1030 1.0876 1.0926 1.0974 1.0990
irintensity: 0.0992 0.3713 3.2258 4.5055 1.0245 4.1854 0.8968 1.5874 5.9738 5.9669 0.3899 3.9553 5.8415 1.6460 0.1064 0.2257 0.0678 1.3883 2.3419 4.9145 5.7590 2.3085 3.9195 0.1236 4.7903 12.5980 52.3056 86.5325 9.9161 9.2004 52.7127 7.4125 1.2294 24.4411 33.0267 99.9705 43.5853 28.7213 3.8369 16.1183 28.1783 0.0160 286.3894 0.4336 0.0919 11.9242 23.6878 38.0378 17.2066 14.3581 79.1452 19.2675 7.4335 40.3908 38.1454 0.0662 2.4198 7.9303 6.9875 8.0294 8.3114 2.5944 2.4912 67.7640 5.3210 10.7132 4.1718 7.7263 10.4134 21.1187 11.1171 25.2587 30.4393 12.7875 12.5681 13.5261 10.7831 8.5204 14.1201 20.2507 11.8168 1.1538 0.6560 0.7627 89.7970 59.7756 33.1737 51.7607 127.6509 87.0632 59.9341 21.6825 40.5989 20.5852 22.5946 14.5902 6.3390 26.7161 3.1375 30.4931 33.7012 8.4441
temp: 298.150 k
press: 1.00000 atm
elementType: 8 8 8 8 6 6 6 6 6 6 6 6 6 6 6 6 6 6 1 1 1 1 1 1 1 1 1 1 1 1 1 1 1 1 1 1
symmnumber: 1
zpe: 777700.9 jmol-1
zpe.correction: 0.296211 hartree
zpe.thermalcorrener: 0.312317 hartree
zpe.thermalcorrenthalpy: 0.313261 hartree
zpe.thermalcorrgfe: 0.251335 hartree
zpe.sumelectzpe: -843.772091 hartree
zpe.sumelectthermal: -843.755985 hartree
zpe.sumelectthermalent: -843.755041 hartree
zpe.sumelectthermalfe: -843.816967 hartree
dipole: 1.8476 -3.4925 -0.2134
dipole: 3.9569
quadrupole: -90.9405 -95.8490 -109.5212
quadrupole: -4.8625 -5.6211 -0.4919
quadrupole: 7.8297 2.9212 -10.7509 -4.8625 -5.6211 -0.4919
hfenergy: -844.0683021 hartree
pointgroup: C01 [X(C14H18O4)]
dipole: 0.7641585 -1.3288596 0.2715105 debye
polarizability: 199.6319975|-3.7582763|155.2935909|-9.6205696|-10.2939068|119.5741755 unknown
InChI: InChI=1S/C14H18O4/c1-15-13-8-7-11-12(17-13)9-16-14(18-11)10-5-3-2-4-6-10/h2-6,11-14H,7-9H2,1H3
charge 0 multiplicity 1
36 atoms
O  2.352825 -0.014853 -0.769241
O  -0.144052 -0.575984 0.933011
O  -0.443989 -0.935576 -1.440116
O  3.771101 1.763879 -0.149066
C  1.11687 -1.349434 0.961694
C  1.807507 -1.333424 -0.429775
C  2.000254 -0.725816 2.052309
C  2.568297 0.641544 1.608012
C  3.291792 0.487521 0.270127
C  0.804526 -1.71019 -1.531074
C  -1.051413 -1.074447 -0.115025
C  -2.310733 -0.248564 -0.07693
C  -2.261014 1.113314 -0.462714
C  -3.531038 -0.813327 0.357422
C  4.535202 1.729831 -1.406522
C  -3.430001 1.901695 -0.412658
C  -4.701963 -0.022818 0.409191
C  -4.652469 1.336452 0.024463
H  0.880015 -2.410572 1.212007
H  2.631189 -2.088889 -0.41471
H  2.828631 -1.427703 2.278545
H  1.400752 -0.615106 2.972668
H  1.749771 1.36819 1.469751
H  3.269561 1.040054 2.362395
H  4.131365 -0.255696 0.33897
H  1.221681 -1.483293 -2.524177
H  0.577971 -2.797745 -1.458582
H  -1.243404 -2.159261 0.079777
H  -1.310003 1.533949 -0.803438
H  -3.568907 -1.868128 0.65709
H  3.88388 1.447027 -2.251374
H  5.382421 1.015395 -1.335242
H  4.921464 2.750909 -1.545647
H  -3.39132 2.95485 -0.712705
H  -5.64627 -0.464456 0.746481
H  -5.559198 1.95097 0.063183
