program: Gaussian 09
title: 000273771
version: EM64L-G09RevD.01
frameworkgroup: C1[X(C8H17O5P)]
method: RPBEPBE
basis: SDD
operation: Freq
keyword: #p
keyword: freq=noraman
keyword: PBEPBE/SDD
title: #p freq=noraman PBEPBE/SDD
converged: YES YES NO NO
title: Mulliken charges:
elementType: P O O O O O C C C C C C C C H H H H H H H H H H H H H H H H H
charge: 1.294640 -0.510077 -0.527449 -0.627086 -0.259563 -0.242858 -0.761556 -0.440689 -0.222195 -0.255256 0.256654 -0.657151 -0.651317 -0.503947 0.293901 0.287546 0.280200 0.267965 0.205462 0.228524 0.224705 0.241197 0.206617 0.233770 0.230733 0.217607 0.248509 0.216746 0.244350 0.237874 0.242146
chargesum: 0.00000
title: Mulliken charges with hydrogens summed into heavy atoms:
elementType: P O O O O O C C C C C C C C
charge: 1.294640 -0.510077 -0.527449 -0.627086 -0.259563 -0.242858 -0.180110 0.107477 0.211791 0.210645 0.256654 0.013969 0.031545 0.220423
polarizability: 1.56849757e+02 2.83962259e+00 1.19268712e+02 3.60161000e+00 -3.35107109e+00 1.09094836e+02
1716.lowfreq: -24.1054 -0.0023 -0.0014 -0.0012 3.2736 7.7105 12.8001 13.8847 22.7038
frequency: -19.4283 12.6115 19.6343 25.5293 50.2399 63.1970 69.4986 102.1420 105.0774 131.3727 145.7727 165.9495 188.2751 194.9428 221.4741 242.4284 247.4411 278.6771 291.1139 331.5568 381.2423 406.2148 429.0052 459.1101 563.2666 587.2925 653.3819 671.4424 741.9123 780.1138 800.3754 807.9784 850.8213 861.9115 878.9261 947.6666 972.8273 1015.5424 1021.8573 1056.9906 1067.2079 1091.8761 1103.3587 1114.1588 1131.8003 1132.9454 1144.7678 1150.8035 1162.8826 1247.8960 1255.3027 1272.9551 1281.5911 1350.2404 1353.7968 1359.1242 1388.3631 1393.2706 1423.8014 1430.4369 1454.4024 1454.7596 1456.2519 1461.6952 1463.7405 1464.4667 1475.7801 1481.8196 1491.5906 1643.0298 2967.2141 2984.8350 2994.3882 2998.0633 3006.8846 3008.2518 3039.8944 3043.4930 3074.2728 3076.2840 3082.0378 3091.4683 3104.4897 3108.5334 3109.4370 3112.6201 3153.4856
redmass: 2.3843 3.7652 2.8922 4.0225 3.2684 2.9663 3.1873 3.2583 1.0695 3.9962 3.2677 4.1221 3.5180 2.8636 1.7368 1.5335 1.7140 3.7108 4.1234 5.7363 4.1714 4.6772 4.5882 4.3325 3.0422 6.1822 4.9513 6.7221 5.2222 1.4041 1.1234 1.0940 5.1856 3.4119 3.7099 6.1121 1.9452 2.9988 2.9852 6.3011 3.8586 2.1407 2.1878 1.2669 1.6546 1.4331 1.5864 1.4415 1.9468 1.2656 1.1489 1.1109 1.1776 1.4846 1.2133 1.3590 1.2297 1.2418 1.1837 1.0916 1.0514 1.0828 1.0402 1.0485 1.0505 1.0672 1.0530 1.0511 1.0808 8.8880 1.0595 1.0355 1.0365 1.0654 1.0299 1.0615 1.1033 1.0587 1.0950 1.1024 1.0977 1.0983 1.1048 1.1017 1.1047 1.1035 1.1049
irintensity: 0.1639 2.1288 0.4032 1.8827 3.9411 0.1759 0.9472 2.9928 0.1821 0.2240 4.2473 16.0414 9.9460 4.5779 1.1442 4.0774 1.6945 37.6965 5.1372 10.5549 15.0084 14.4214 6.9600 46.6001 6.7002 36.3332 38.1486 93.0358 45.2796 21.7543 5.2543 2.2830 14.8172 139.9737 122.8421 6.6786 6.1508 167.2615 148.0144 72.8864 21.8972 13.1605 9.8990 0.3975 104.4084 2.1065 6.7478 10.0502 181.8503 69.3538 1.9477 0.1870 20.4989 38.1935 10.4847 12.3740 25.2232 23.0219 18.4567 18.9596 19.6857 27.3430 11.3830 12.7377 14.1609 6.4221 3.9997 15.5786 6.8555 158.0817 40.5649 15.6211 24.1221 11.6246 30.3837 31.4153 23.9060 3.1970 1.0875 3.1459 41.2225 27.7477 35.2431 34.3170 24.8582 3.2386 14.6408
temp: 298.150 k
press: 1.00000 atm
elementType: 15 8 8 8 8 8 6 6 6 6 6 6 6 6 1 1 1 1 1 1 1 1 1 1 1 1 1 1 1 1 1
symmnumber: 1
zpe: 654564.2 jmol-1
zpe.correction: 0.249310 hartree
zpe.thermalcorrener: 0.267454 hartree
zpe.thermalcorrenthalpy: 0.268399 hartree
zpe.thermalcorrgfe: 0.199077 hartree
zpe.sumelectzpe: -1031.234595 hartree
zpe.sumelectthermal: -1031.216451 hartree
zpe.sumelectthermalent: -1031.215507 hartree
zpe.sumelectthermalfe: -1031.284828 hartree
dipole: 0.8832 1.8034 -2.2095
dipole: 2.9857
quadrupole: -68.2900 -87.7549 -106.4902
quadrupole: -0.4798 9.5825 2.6025
quadrupole: 19.2217 -0.2432 -18.9785 -0.4798 9.5825 2.6025
hfenergy: -1031.4839054 hartree
pointgroup: C01 [X(C8H17O5P1)]
dipole: 0.3627113 -0.3387812 1.0646532 debye
polarizability: 155.9111822|-6.9054658|116.0477583|-4.0838219|-5.5869728|113.2543643 unknown
InChI: InChI=1S/C8H17O5P/c1-4-12-14(10,13-5-2)7-6-8(9)11-3/h4-7H2,1-3H3
charge 0 multiplicity 1
31 atoms
P  -0.986345 0.601089 -0.47804
O  -1.321195 -1.073645 -0.098805
O  -1.942732 1.545266 0.631805
O  -1.242323 0.888342 -2.020977
O  4.139022 -0.265575 -0.71174
O  3.341747 0.546082 1.321248
C  0.72418 0.927898 0.18872
C  1.773692 0.065778 -0.535955
C  -1.450267 -1.505205 1.321694
C  -3.260685 2.059104 0.151143
C  3.129535 0.163404 0.14767
C  -1.963369 -2.942725 1.287865
C  -4.360926 0.999158 0.262454
C  5.511644 -0.269194 -0.144845
H  0.919384 2.004298 0.04902
H  0.721074 0.729086 1.273224
H  1.875689 0.351996 -1.596775
H  1.473089 -1.001515 -0.534181
H  -0.459429 -1.444641 1.817508
H  -2.151236 -0.82934 1.846738
H  -3.45229 2.921803 0.8103
H  -3.145941 2.409286 -0.892211
H  -2.069819 -3.332784 2.317314
H  -2.945665 -2.989655 0.788351
H  -1.263462 -3.592846 0.736001
H  -5.333308 1.438111 -0.030209
H  -4.156817 0.144713 -0.40675
H  -4.448539 0.628558 1.298947
H  5.799202 0.750408 0.161285
H  6.149364 -0.634382 -0.961391
H  5.560926 -0.938472 0.73039
