program: Gaussian 09
title: 000273785
version: EM64L-G09RevD.01
frameworkgroup: C1[X(C19H17NO)]
method: RPBEPBE
basis: SDD
operation: Freq
keyword: #p
keyword: freq=noraman
keyword: PBEPBE/SDD
title: #p freq=noraman PBEPBE/SDD
converged: YES YES NO NO
title: Mulliken charges:
elementType: O N C C C C C C C C C C C C C C C C C C C H H H H H H H H H H H H H H H H H
charge: -0.272055 -0.211047 0.212693 0.161623 0.187723 0.217845 -0.365647 -0.343712 -0.662813 -0.797189 -0.269654 -0.226623 -0.276405 -0.325641 0.086243 0.289248 -0.348812 -0.358238 -0.252598 -0.236846 -0.232957 0.237696 0.220437 0.255510 0.245310 0.245294 0.241981 0.264854 0.241653 0.242888 0.224926 0.224405 0.200787 0.217434 0.279345 0.225390 0.228305 0.228647
chargesum: 0.00000
title: Mulliken charges with hydrogens summed into heavy atoms:
elementType: O N C C C C C C C C C C C C C C C C C C C
charge: -0.272055 -0.211047 0.212693 0.161623 0.187723 0.217845 -0.127951 -0.123275 0.083301 -0.048702 -0.026766 -0.001697 -0.052000 -0.124854 0.086243 0.289248 -0.131377 -0.078892 -0.027208 -0.008541 -0.004311
polarizability: 4.20473932e+02 -5.39562105e-01 2.56138542e+02 3.55515487e+00 3.41762286e+00 9.31698373e+01
1716.lowfreq: -4.7465 -1.7737 -0.0004 0.0004 0.0007 5.1984 15.3117 25.0224 42.9934
frequency: 14.8631 24.9918 42.9854 66.6956 91.7497 100.6133 129.5432 133.2019 146.6696 160.0536 182.4521 193.0260 228.5226 264.6042 285.8286 314.9291 316.5169 383.9180 395.8043 402.4603 439.6276 442.1331 469.3865 494.3089 553.7699 575.3683 578.7243 614.2614 614.9805 644.6939 657.7731 688.5423 697.7874 704.4277 749.4461 766.6661 780.6638 793.2282 834.8814 844.2592 852.8970 867.2978 901.8666 932.0829 938.4588 973.6917 985.2456 989.3933 994.7420 1001.0780 1008.8119 1014.8654 1028.3488 1038.7693 1040.8832 1059.2387 1085.6048 1119.3102 1128.5028 1138.0579 1161.4954 1170.6864 1186.3666 1195.0598 1221.5969 1257.1619 1296.3280 1304.1721 1331.2129 1335.5441 1378.1180 1384.3673 1400.4802 1412.0807 1426.3973 1431.5848 1445.5488 1453.7853 1463.9057 1472.4833 1477.4674 1482.3952 1483.2893 1498.5732 1508.3572 1530.0459 1586.9681 1588.0709 1607.9639 1625.0789 1631.7029 2974.1640 2983.6812 3042.9026 3059.4839 3090.6099 3114.5466 3123.8960 3124.2302 3130.1474 3134.3723 3141.9287 3147.5185 3157.0566 3159.0323 3166.6700 3173.3385 3190.1054
redmass: 4.1838 4.4460 5.1648 4.9070 1.0579 3.2122 2.8703 2.5601 4.9987 1.2458 5.5098 3.9606 2.9527 3.6849 5.0902 3.8854 2.9423 3.5942 5.6700 3.0109 2.9669 3.8197 5.1978 5.1445 5.4910 5.6417 3.7616 6.3669 4.0009 3.6822 5.9952 4.2603 1.5311 5.3396 1.3710 3.2519 4.1491 2.1229 4.7508 1.6420 1.3183 1.7401 3.5495 1.4031 1.4600 1.3148 1.3942 5.6246 1.2264 2.2534 1.3443 2.9904 1.9740 1.4969 2.6837 2.6928 1.6767 1.3112 1.6914 1.5824 1.4665 1.0651 1.1332 1.9865 2.0957 1.9189 1.9434 1.5180 1.9297 1.4828 2.9277 8.8818 1.4133 3.5863 2.1919 2.3384 1.5912 1.9953 1.0435 2.6841 2.2080 1.0549 1.7687 1.3754 5.5547 3.9312 6.6030 6.3277 6.0093 7.4985 5.9172 1.0407 1.0367 1.0978 1.1018 1.0871 1.0937 1.0847 1.0968 1.0853 1.0882 1.0904 1.0926 1.0956 1.0959 1.1005 1.0973 1.0888
irintensity: 1.6095 2.3974 0.8940 0.5772 0.0992 0.0678 0.2404 5.5719 0.9185 0.5373 1.2072 0.6021 1.4526 3.4877 9.3090 0.5188 0.5361 1.2170 0.1077 0.2056 3.7954 2.0636 2.6694 1.8169 23.7617 30.6307 0.4131 1.8858 5.4296 0.2919 14.1349 4.7254 91.0096 1.0723 66.7329 3.1483 29.0886 49.7852 6.2143 11.3072 1.4951 10.0961 10.3726 2.1137 1.1906 0.3155 5.0289 0.6538 25.0928 41.9626 3.0065 54.1100 0.6295 1.6051 66.9782 3.4917 15.9765 0.6141 44.9452 2.9138 1.1647 7.5801 39.0807 3.5966 139.0847 11.2797 335.5344 254.6366 20.2399 18.8467 209.5887 3.0833 7.2794 78.1767 23.0942 2.5315 60.4485 14.0045 29.0853 8.2711 7.6044 1.5973 59.9288 85.9123 291.2749 23.5112 50.2258 18.4539 50.6866 16.2481 597.4356 42.5764 82.9409 14.5241 21.7169 3.6204 8.5455 1.1657 7.7437 0.0201 9.6878 13.0454 27.4912 12.1088 50.3842 32.1397 5.8853 17.4486
temp: 298.150 k
press: 1.00000 atm
elementType: 8 7 6 6 6 6 6 6 6 6 6 6 6 6 6 6 6 6 6 6 6 1 1 1 1 1 1 1 1 1 1 1 1 1 1 1 1 1
symmnumber: 1
zpe: 799018.6 jmol-1
zpe.correction: 0.304330 hartree
zpe.thermalcorrener: 0.323015 hartree
zpe.thermalcorrenthalpy: 0.323959 hartree
zpe.thermalcorrgfe: 0.255294 hartree
zpe.sumelectzpe: -862.744985 hartree
zpe.sumelectthermal: -862.726301 hartree
zpe.sumelectthermalent: -862.725356 hartree
zpe.sumelectthermalfe: -862.794021 hartree
dipole: 5.5984 1.0168 0.2544
dipole: 5.6957
quadrupole: -87.2553 -114.2077 -130.7534
quadrupole: -19.0153 0.9065 0.4011
quadrupole: 23.4835 -3.4689 -20.0146 -19.0153 0.9065 0.4011
hfenergy: -863.0493151 hartree
pointgroup: C01 [X(C19H17N1O1)]
dipole: -2.2062584 -0.3782573 0.1035493 debye
polarizability: 420.3561441|-2.2670405|256.1862572|-6.3956584|3.0549111|93.2399105 unknown
InChI: InChI=1S/C19H17NO/c1-14-16(17-10-6-7-11-18(17)20(14)2)12-13-19(21)15-8-4-3-5-9-15/h3-13H,1-2H3
charge 0 multiplicity 1
38 atoms
O  2.376637 2.37903 0.062333
N  -3.855802 0.913343 0.191821
C  -3.560587 -0.460635 0.085546
C  -2.133031 -0.604363 0.03524
C  -2.662592 1.641241 0.20945
C  -1.563489 0.743449 0.11735
C  -4.447721 -1.554289 0.029927
C  -1.595795 -1.91157 -0.082383
C  -5.218171 1.444536 0.270661
C  -2.662271 3.138658 0.316143
C  -0.190032 1.180078 0.116537
C  -3.882941 -2.842554 -0.082754
C  -2.472363 -3.015875 -0.139826
C  0.965248 0.42816 0.072137
C  2.279539 1.100999 0.068563
C  3.539421 0.266899 0.063586
C  3.55347 -1.144869 0.229728
C  4.777385 0.945775 -0.103448
C  4.773287 -1.856425 0.226159
C  5.994429 0.236943 -0.112098
C  5.99705 -1.169733 0.052198
H  -5.533862 -1.419923 0.070415
H  -0.517206 -2.079591 -0.134652
H  -5.190941 2.541257 0.346082
H  -5.796878 1.171023 -0.630754
H  -5.741437 1.046179 1.159353
H  -3.138295 3.486577 1.253143
H  -1.632145 3.524241 0.309147
H  -3.198444 3.613329 -0.528095
H  -0.012736 2.265278 0.157785
H  -4.538554 -3.71895 -0.12897
H  -2.060258 -4.02673 -0.231471
H  0.93067 -0.661512 0.030492
H  2.621334 -1.698994 0.378764
H  4.746315 2.034087 -0.220755
H  4.770025 -2.943923 0.360899
H  6.939972 0.774413 -0.245459
H  6.942566 -1.723956 0.047304
