program: Gaussian 09
title: 000273764
version: EM64L-G09RevD.01
frameworkgroup: C1[X(C12H5Cl4NO3)]
method: RPBEPBE
basis: SDD
operation: Freq
keyword: #p
keyword: freq=noraman
keyword: PBEPBE/SDD
title: #p freq=noraman PBEPBE/SDD
converged: YES YES NO NO
title: Mulliken charges:
elementType: Cl Cl Cl Cl O O O N C C C C C C C C C C C C H H H H H
charge: 0.013896 0.024395 0.022689 0.026730 -0.259284 -0.204830 -0.203596 0.021426 0.490160 0.488979 -0.300721 -0.269657 0.409156 -0.324271 -0.321260 -0.357442 -0.374335 -0.065297 -0.176540 -0.105159 0.272092 0.296465 0.313960 0.292634 0.289812
chargesum: 0.00000
title: Mulliken charges with hydrogens summed into heavy atoms:
elementType: Cl Cl Cl Cl O O O N C C C C C C C C C C C C
charge: 0.013896 0.024395 0.022689 0.026730 -0.259284 -0.204830 -0.203596 0.021426 0.490160 0.488979 -0.300721 0.002435 0.409156 -0.324271 -0.024795 -0.043482 -0.081701 -0.065297 0.113272 -0.105159
polarizability: 3.00318333e+02 5.51516856e+00 1.62951923e+02 1.35692715e+01 -5.29775035e+00 1.40058488e+02
1716.lowfreq: -5.0906 -3.6361 0.0015 0.0021 0.0028 2.2951 14.1431 23.5593 35.1633
frequency: 14.0244 23.5573 35.1527 58.6645 72.1193 92.8739 130.7290 142.8008 168.2949 174.6481 179.2825 201.1011 216.6184 247.1019 306.5137 313.8553 319.9870 338.7883 375.9061 399.0478 442.5416 447.6929 463.9758 500.9196 527.9722 530.3709 567.4614 591.1259 637.2107 654.6956 671.8650 684.7761 700.8941 713.7275 725.8335 765.6126 833.4499 844.3216 855.6654 881.1577 903.7472 921.3293 978.5020 1028.9151 1036.7159 1102.1330 1106.1932 1140.0677 1189.3860 1211.3899 1227.1338 1239.9962 1252.8746 1325.3718 1357.9107 1360.2788 1402.5248 1410.4038 1438.2195 1463.2269 1557.7414 1574.0463 1586.2769 1601.4708 3162.9697 3181.5667 3183.7226 3188.3929 3191.3144
redmass: 17.9561 12.0257 15.0144 17.0986 20.6545 8.5855 23.8228 11.3531 5.6662 13.3923 25.9130 10.3204 8.0731 12.4435 13.5762 16.2129 9.5829 12.8861 14.1108 9.4095 3.2941 3.9887 7.5110 7.1445 6.2037 5.1608 8.1065 9.6960 8.2623 6.6258 6.1994 6.0668 6.2395 6.1001 4.6849 8.9965 1.4541 8.0319 1.4668 1.4486 8.1996 1.4245 1.3422 3.1177 5.5356 3.2500 1.8127 1.2499 4.7911 6.8358 1.2545 3.4785 1.6308 9.0489 10.4297 7.2804 10.0616 5.2704 3.1891 2.8859 10.5919 7.7710 8.2200 7.8938 1.0898 1.0928 1.0936 1.0929 1.0958
irintensity: 0.2769 0.2809 0.2102 0.0069 0.2435 3.0033 0.0703 0.2974 0.2376 2.7590 0.0792 0.1362 0.1755 2.4263 0.4391 0.3605 0.5773 0.7254 3.8660 0.3431 5.5129 13.5101 7.8182 1.6838 3.5786 0.2069 22.9972 14.1214 19.0436 11.6731 6.7240 7.1750 28.6539 20.8242 9.5217 2.3879 30.5688 41.7147 2.9086 37.3752 50.4375 24.3619 2.5198 38.7952 129.3677 31.5151 91.7453 39.8942 0.8987 540.0500 21.7185 324.5078 4.4213 68.7445 13.8770 47.8649 42.6784 75.2494 331.7037 123.9769 0.6754 38.8070 24.5996 100.1086 2.1851 4.0247 0.6921 8.7739 5.4295
temp: 298.150 k
press: 1.00000 atm
elementType: 17 17 17 17 8 8 8 7 6 6 6 6 6 6 6 6 6 6 6 6 1 1 1 1 1
symmnumber: 1
zpe: 377877.3 jmol-1
zpe.correction: 0.143926 hartree
zpe.thermalcorrener: 0.162108 hartree
zpe.thermalcorrenthalpy: 0.163052 hartree
zpe.thermalcorrgfe: 0.093755 hartree
zpe.sumelectzpe: -2579.427442 hartree
zpe.sumelectthermal: -2579.409260 hartree
zpe.sumelectthermalent: -2579.408316 hartree
zpe.sumelectthermalfe: -2579.477613 hartree
dipole: -4.4019 0.2810 0.3189
dipole: 4.4224
quadrupole: -175.8186 -148.4532 -137.4930
quadrupole: 11.6524 -1.8457 -2.3814
quadrupole: -21.8970 5.4684 16.4286 11.6524 -1.8457 -2.3814
hfenergy: -2579.5713679 hartree
pointgroup: C01 [X(C12H5Cl4N1O3)]
dipole: 1.7339848 0.1182827 0.0809953 debye
dipolederiv: -0.0645358 0.0115002 0.0621389 0.0231501 -0.0533875 -0.1509251 0.0938947 -0.1515304 -0.6520235 -0.2326763 -0.255318 -0.0194683 -0.2752066 -0.5441407 0.0305529 0.0079081 0.0601576 -0.0264266 -0.2392113 -0.2664634 0.024344 -0.381911 -0.5651338 0.0822643 0.0328313 0.0854212 -0.0311657 -0.6478201 -0.0804805 -0.2665924 -0.0518398 -0.0498228 -0.0074021 -0.3505897 -0.0279775 -0.1620392 -2.4966854 -0.1394529 -0.0332737 -0.2597658 -0.2399916 -0.0117169 0.0023027 -0.0050615 -0.3012369 -0.6377477 0.0110509 0.1774162 0.0510605 -0.2527687 -0.1326885 0.3258943 -0.1231848 -0.8027811 -0.9867743 -0.0836039 -0.0924785 -0.1021589 -0.250869 -0.0756355 -0.1778705 -0.0813713 -0.4938095 2.072213 0.0681043 -0.3193461 0.0395552 0.2431596 0.2095224 -0.4152375 0.2047199 1.1172776 2.0232477 0.0573346 -0.1095327 0.037622 0.1507554 -0.0300094 -0.7517614 -0.063794 -0.0102374 1.4362079 0.0018866 0.2340075 0.2251337 0.0507317 0.0123318 0.8154938 0.0115564 0.1843441 -0.5650204 -0.0424747 -0.0818099 -0.0747553 -0.0284041 0.2906521 -0.216048 0.2830939 1.1039862 -0.3745081 -0.0076891 0.0250033 0.0960535 -0.1254539 -0.0070569 0.5656556 0.0217867 -0.1475708 -0.900476 -0.0012594 0.2624584 0.0094657 0.0362157 -0.0091649 0.3520577 -0.0062089 -0.0797366 0.0908778 0.4295755 0.0432813 0.3783778 0.7920677 -0.0604377 -0.0876886 -0.103589 -0.0418779 -0.2987356 -0.0800981 0.0196887 -0.1360624 -0.2096727 0.0101317 -0.034474 0.0198385 -0.0430645 0.1770234 0.025072 0.0298608 -0.0719921 -0.0575171 -0.0229906 -0.3480986 -0.0487641 -0.1476725 0.4096 0.0167352 -0.0944516 0.0676426 -0.0842363 0.0008838 0.0627929 0.0173579 -0.0412653 0.1124186 0.4725109 -0.1260092 0.5590987 0.8767524 -0.1626261 -0.1237093 -0.1250491 -0.0469479 -0.2579824 -0.0978472 -0.0913722 -0.1104962 -0.1792058 -0.0343734 -0.0900942 0.0076234 -0.0581783 0.899688 -0.0012619 0.4995378 0.0207796 -0.107736 0.057158 0.5482288 0.0203731 0.2064464 0.0301487 -0.0249801 -0.0410312 -0.0578969 0.1264793 -0.0209835 -0.104153 -0.0250792 0.0443515 0.1274793 0.0027158 -0.0474795 0.027087 0.0755302 0.0306914 -0.0654506 0.0316229 0.1196179 0.1191112 -0.0151673 -0.0477547 -0.0052639 0.167648 -0.015406 0.0042717 -0.0129076 0.1215652 0.1174708 0.0040251 0.0235361 -0.0033154 0.1611224 -0.0248577 -0.0049514 -0.0293578 0.0612487 0.0866871 -0.0044146 -0.0306731 -0.0043621 0.0678777 0.0420857 -0.0412047 0.0403238 0.1271961 unknown
polarizability: 290.7954176|38.1479798|147.2422316|12.6746684|5.0398614|165.2910948 unknown
InChI: InChI=1S/C12H5Cl4NO3/c13-7-4-10(16)12(5-8(7)14)20-11-2-1-6(17(18)19)3-9(11)15/h1-5H
charge 0 multiplicity 1
25 atoms
Cl -1.639254 -0.926344 -3.244172
Cl 1.353588 -2.694041 0.361167
Cl 4.436669 2.915256 -0.207562
Cl 5.713479 0.477192 1.599527
O  0.477014 -0.236359 -1.30497
O  -4.874124 0.178288 2.184055
O  -5.718692 -0.404837 0.14443
N  -4.737001 -0.125718 0.93594
C  -0.779246 -0.212107 -0.683648
C  1.653039 -0.059711 -0.53916
C  -1.897216 -0.510924 -1.506934
C  -0.97556 0.11796 0.678748
C  -3.366822 -0.154693 0.37899
C  2.209728 -1.110058 0.228004
C  2.34366 1.161461 -0.666048
C  -3.195999 -0.484975 -0.984405
C  -2.273176 0.147613 1.217652
C  3.582314 1.338986 -0.019026
C  3.445118 -0.934797 0.878487
C  4.130953 0.292063 0.755952
H  -0.11328 0.351849 1.309678
H  1.912673 1.956674 -1.279483
H  -4.067181 -0.713308 -1.603173
H  -2.451767 0.399271 2.265705
H  3.877383 -1.74614 1.469344
