program: Gaussian 09
title: 000273749
version: EM64L-G09RevD.01
frameworkgroup: C1[X(C11H12ClFN2O6)]
method: RPBEPBE
basis: SDD
operation: Freq
keyword: #p
keyword: freq=noraman
keyword: PBEPBE/SDD
title: #p freq=noraman PBEPBE/SDD
converged: NO YES NO NO
title: Mulliken charges:
elementType: Cl F O O O O O O N N C C C C C C C C C C C H H H H H H H H H H H H
charge: -0.055659 -0.167474 -0.230762 -0.460922 -0.265136 -0.209464 -0.253699 -0.220020 -0.175578 -0.414584 -0.045554 -0.512629 -0.143364 -0.186956 0.264509 0.240816 -0.175232 0.160377 0.111061 -0.250632 -0.544851 0.295802 0.278983 0.276459 0.265279 0.281712 0.360164 0.346384 0.367445 0.242352 0.272238 0.269673 0.279262
chargesum: 0.00000
title: Mulliken charges with hydrogens summed into heavy atoms:
elementType: Cl F O O O O O O N N C C C C C C C C C C C
charge: -0.055659 -0.167474 -0.230762 -0.100757 -0.265136 -0.209464 -0.253699 -0.220020 -0.175578 -0.047139 0.250248 0.042813 0.121915 0.094756 0.264509 0.240816 0.171152 0.160377 0.111061 0.263958 0.004084
polarizability: 2.29772032e+02 -6.70468558e+00 1.47483216e+02 -5.46888185e+00 -7.51117982e+00 1.09787491e+02
1716.lowfreq: -12.7144 -0.0020 -0.0015 -0.0011 3.3241 4.1288 14.7012 25.0688 32.5444
frequency: 14.4427 24.9057 32.4846 42.6473 56.8315 56.9604 104.7762 114.3688 132.5105 157.1840 170.0556 179.5077 220.9213 232.7268 258.5686 287.4991 304.4990 310.1095 318.1178 343.9879 348.0413 379.1180 385.6830 411.4168 453.7005 457.9131 488.0489 537.4472 607.4275 615.3136 663.6056 676.2934 688.2847 698.7502 711.6443 718.3898 744.1304 769.2260 775.2649 805.9877 817.6166 876.1877 888.4443 892.9239 917.6052 938.1728 944.2150 956.3629 995.5435 1015.0635 1034.6648 1048.9521 1070.2153 1107.5065 1116.7838 1131.0215 1157.7509 1175.4937 1183.6029 1206.6582 1221.6845 1227.8504 1268.7263 1270.2402 1285.3711 1298.4560 1305.8555 1328.3152 1334.5132 1357.2667 1362.9718 1370.4092 1386.2111 1426.8543 1434.6506 1449.9032 1459.6638 1633.5323 1648.4007 1659.7888 1674.7390 3016.9256 3025.0939 3055.0881 3063.5712 3080.1638 3091.7432 3092.3595 3121.2549 3123.9886 3149.4707 3523.5928 3577.0524
redmass: 9.9390 10.6693 7.1875 12.7205 8.3209 7.3018 9.8273 6.9876 4.4922 5.7567 5.7895 5.8832 8.0149 7.2631 3.7859 14.9203 4.6638 1.2824 3.1395 6.7473 5.4248 10.0893 4.4291 2.8243 4.5061 4.9870 5.2361 6.8868 4.7188 5.9694 7.7033 5.0979 2.3964 5.7303 7.2166 7.5899 8.0612 3.9650 2.3772 3.0894 3.6168 4.0435 3.7176 3.3022 2.9549 1.4579 2.3666 2.7578 1.9323 3.6518 3.7727 2.9903 2.1401 2.4865 3.3806 6.0258 1.2162 1.5324 1.3339 4.5862 1.1795 1.3766 1.8588 1.6396 1.3740 1.2045 1.3553 1.3878 2.4069 1.3640 1.6961 1.4952 1.6763 2.1251 1.1009 1.0974 1.0824 5.6437 12.3340 10.0785 6.2800 1.0584 1.0864 1.0627 1.0589 1.0873 1.0880 1.1049 1.0977 1.1037 1.1103 1.0770 1.0665
irintensity: 1.2765 0.7402 0.5886 0.3367 0.5562 3.4405 1.0504 0.7672 0.7003 3.2201 6.0693 4.9579 5.2152 6.9169 7.6373 1.9726 14.8786 108.2931 27.9145 8.4362 13.9214 14.1883 6.0872 15.8966 13.8906 14.3171 0.7211 24.1116 19.4447 1.0585 18.0060 12.2000 17.5149 10.1115 7.1793 16.1189 3.8772 31.4622 98.6495 7.2753 2.3208 29.5056 43.6714 2.6571 38.1267 27.2147 11.2059 66.1632 5.3912 236.8165 207.4518 107.2001 39.9865 228.9411 14.2836 64.6861 53.1498 32.4296 1.9853 23.9531 16.4567 74.0563 155.1434 122.2908 74.4660 23.7126 6.1981 5.8843 42.0710 6.1613 34.4279 6.8068 6.5866 47.0433 10.3288 20.5261 23.0808 299.2611 205.2131 208.0535 466.2496 26.4273 14.2155 5.1809 21.0524 7.7108 3.5644 2.4614 94.7291 29.0023 7.2564 67.2272 16.2153
temp: 298.150 k
press: 1.00000 atm
elementType: 17 9 8 8 8 8 8 8 7 7 6 6 6 6 6 6 6 6 6 6 6 1 1 1 1 1 1 1 1 1 1 1 1
symmnumber: 1
zpe: 616670.7 jmol-1
zpe.correction: 0.234877 hartree
zpe.thermalcorrener: 0.254881 hartree
zpe.thermalcorrenthalpy: 0.255825 hartree
zpe.thermalcorrgfe: 0.182894 hartree
zpe.sumelectzpe: -1545.543592 hartree
zpe.sumelectthermal: -1545.523589 hartree
zpe.sumelectthermalent: -1545.522645 hartree
zpe.sumelectthermalfe: -1545.595576 hartree
dipole: 10.0907 1.9875 -0.9051
dipole: 10.3244
quadrupole: -135.1373 -137.0617 -126.2769
quadrupole: 9.2920 -16.8730 -0.0853
quadrupole: -2.3120 -4.2364 6.5484 9.2920 -16.8730 -0.0853
hfenergy: -1545.7784699 hartree
pointgroup: C01 [X(C11H12Cl1F1N2O6)]
dipole: -3.9996023 -0.5792774 0.4084189 debye
polarizability: 228.6827548|3.4361751|118.5915716|12.8483521|-17.5155677|139.7684129 unknown
InChI: InChI=1S/C11H12ClFN2O6/c12-1-2-20-10(18)8-6(16)3-7(21-8)15-4-5(13)9(17)14-11(15)19/h4,6-8,14,16H,1-3H2
charge 0 multiplicity 1
33 atoms
Cl -5.505521 1.082863 0.938831
F  3.780457 -1.204375 2.437258
O  -0.228482 -0.683051 -0.736337
O  -0.676717 -0.468825 2.276729
O  -3.805928 -1.075385 -0.678492
O  -2.623263 0.633647 -1.768191
O  2.453823 1.624727 -2.108176
O  5.785659 -0.229349 0.611023
N  1.775485 0.484378 -0.149527
N  4.068868 0.675581 -0.705776
C  0.352211 0.667623 -0.48385
C  -0.520974 1.309335 0.632694
C  -1.409783 0.173366 1.178138
C  -1.516636 -0.779661 -0.056822
C  -2.664455 -0.312232 -0.95774
C  2.74479 0.973041 -1.070906
C  2.138587 -0.237938 0.990598
C  3.449036 -0.491064 1.284411
C  4.554195 -0.047589 0.428255
C  -5.09153 -0.615304 -1.263389
C  -6.075764 -0.363057 -0.132851
H  0.332506 1.240911 -1.423183
H  -1.150524 2.095839 0.188601
H  0.082193 1.751777 1.440178
H  -2.400152 0.525308 1.522239
H  -1.67172 -1.831267 0.232435
H  -1.247556 -1.140449 2.72664
H  1.318324 -0.577211 1.634178
H  4.785961 1.023205 -1.351185
H  -5.459531 -1.440467 -1.900504
H  -4.913773 0.281761 -1.881098
H  -7.064483 -0.079006 -0.524485
H  -6.155402 -1.222133 0.548405
