program: Gaussian 09
title: 000273743
version: EM64L-G09RevD.01
frameworkgroup: C1[X(C11H18N2O4)]
method: RPBEPBE
basis: SDD
operation: Freq
keyword: #p
keyword: freq=noraman
keyword: PBEPBE/SDD
title: #p freq=noraman PBEPBE/SDD
converged: YES YES NO NO
title: Mulliken charges:
elementType: O O O O N N C C C C C C C C C C C H H H H H H H H H H H H H H H H H H
charge: -0.444151 -0.271845 -0.204302 -0.243538 -0.440916 -0.501688 -0.051082 -0.076694 -0.511984 -0.458064 -0.419774 0.334710 0.186022 0.153913 -0.779765 -0.186467 -0.511186 0.270067 0.195281 0.233566 0.196567 0.236874 0.219545 0.209048 0.223436 0.295886 0.371795 0.304770 0.244196 0.265100 0.229647 0.227731 0.216539 0.235613 0.251150
chargesum: 0.00000
title: Mulliken charges with hydrogens summed into heavy atoms:
elementType: O O O O N N C C C C C C C C C C C
charge: -0.072356 -0.271845 -0.204302 -0.243538 -0.145030 -0.196919 0.218986 0.118587 -0.081851 -0.001645 0.012710 0.334710 0.186022 0.153913 -0.040822 0.041264 0.192116
polarizability: 2.04416485e+02 -1.00953840e+01 1.48928558e+02 -2.50629199e+00 3.57501942e+00 1.12112074e+02
1716.lowfreq: -9.8678 -3.7917 -0.0006 -0.0006 -0.0005 2.1828 19.1712 25.0891 47.2885
frequency: 18.2853 24.7488 47.2645 52.8174 65.2506 84.0297 97.5801 104.7392 112.6854 133.0003 181.8112 187.5481 191.5260 233.7499 255.0224 277.4881 291.9541 351.6753 374.9548 388.9493 399.6419 424.4126 473.4794 492.1057 527.8317 545.4729 555.9118 592.5347 658.4327 679.1293 696.7662 719.9528 760.1535 792.6939 831.2739 853.5175 880.9412 906.8351 912.1650 920.9762 944.5386 971.2145 998.8496 1032.7513 1046.0806 1047.3057 1069.5357 1083.9488 1097.9459 1109.1318 1113.9290 1119.5431 1165.5650 1171.4140 1191.8009 1201.8219 1229.1221 1255.4839 1267.6427 1275.4301 1287.7493 1298.2490 1310.8073 1322.3856 1355.8868 1361.2202 1393.1213 1401.6702 1424.9569 1436.5672 1454.7184 1460.2231 1461.8533 1469.5499 1469.8718 1472.2948 1476.2079 1487.5572 1606.7669 1643.3616 1652.9793 2927.4946 2969.1471 2985.5494 2986.1703 2996.3972 3004.1326 3010.1283 3051.6283 3064.5363 3069.2521 3074.3390 3079.4592 3088.5594 3117.0895 3134.2987 3361.2848 3531.4034 3538.5909
redmass: 4.1847 3.8116 2.7237 3.9911 2.3541 4.7022 3.3696 1.0581 4.0382 1.9380 3.5261 2.2748 4.5847 4.7274 5.4659 3.6291 5.2090 4.1062 4.2849 3.5789 3.6660 3.1208 1.2916 3.2171 3.6199 2.1789 1.5645 2.6858 3.6700 5.9240 1.1559 6.3592 3.9952 1.8216 1.9011 1.6894 4.0386 1.8366 2.5726 6.0891 3.4508 2.0686 2.3223 2.9056 2.8276 1.4543 2.2617 2.1903 3.3751 1.2792 2.1836 1.7150 1.5218 1.5450 2.7719 1.6527 1.5806 1.2638 2.0476 1.2561 1.2879 1.3170 1.3094 1.3619 1.3809 1.3367 1.3718 1.8412 1.5282 1.1834 1.7077 1.0571 1.0662 1.0545 1.0996 1.0622 1.1858 1.1100 5.5671 7.4897 6.5242 1.0842 1.0328 1.0638 1.0394 1.0840 1.0653 1.0647 1.0983 1.1040 1.0936 1.1001 1.0918 1.1034 1.1003 1.1007 1.0654 1.0774 1.0773
irintensity: 1.4100 0.6695 0.7382 0.9128 1.8186 7.3218 0.9029 0.2664 2.6476 2.4343 3.9918 2.6072 6.6681 1.3912 7.4041 9.3614 3.1231 0.9429 14.9073 2.4792 3.3414 26.3995 58.9371 23.3534 5.7540 33.2742 65.8897 5.7504 3.4439 7.5235 133.8236 108.3421 5.5182 4.0177 3.3562 8.7152 11.2325 2.8923 4.0307 15.9115 16.3104 1.7323 10.0179 19.2777 28.5902 5.3182 26.0246 143.2382 5.1979 31.4285 233.1670 133.4681 10.1678 25.6305 252.3776 117.0455 107.7302 0.9796 31.0488 12.6448 6.4458 16.3284 2.6787 49.1041 12.0655 15.8787 197.0228 347.6095 45.6231 1.2960 375.9826 31.0648 10.4228 27.3954 31.6639 4.9804 92.3791 6.0350 83.5852 148.4002 330.6102 43.8842 80.8790 41.1130 20.3121 15.0615 46.0731 24.2979 12.7600 42.4587 15.1789 52.0593 16.9776 51.4916 6.0214 18.3085 250.9321 7.0549 25.5198
temp: 298.150 k
press: 1.00000 atm
elementType: 8 8 8 8 7 7 6 6 6 6 6 6 6 6 6 6 6 1 1 1 1 1 1 1 1 1 1 1 1 1 1 1 1 1 1
symmnumber: 1
zpe: 752031.3 jmol-1
zpe.correction: 0.286434 hartree
zpe.thermalcorrener: 0.305215 hartree
zpe.thermalcorrenthalpy: 0.306159 hartree
zpe.thermalcorrgfe: 0.236771 hartree
zpe.sumelectzpe: -839.029742 hartree
zpe.sumelectthermal: -839.010961 hartree
zpe.sumelectthermalent: -839.010016 hartree
zpe.sumelectthermalfe: -839.079405 hartree
dipole: -2.9896 8.5815 -2.7319
dipole: 9.4891
quadrupole: -90.9517 -104.2969 -102.5277
quadrupole: -3.7384 -15.0930 6.2033
quadrupole: 8.3071 -5.0381 -3.2690 -3.7384 -15.0930 6.2033
hfenergy: -839.3161757 hartree
pointgroup: C01 [X(C11H18N2O4)]
dipole: -1.0506232 -3.5620009 -0.3820149 debye
polarizability: 203.9039881|10.8889638|140.7874998|4.2140115|16.1545887|120.7656291 unknown
InChI: InChI=1S/C11H18N2O4/c1-7(6-17-2)10(15)13-11(16)12-8-4-3-5-9(8)14/h6,8-9,12-14H,3-5H2,1-2H3
charge 0 multiplicity 1
35 atoms
O  3.385524 1.764783 -0.779906
O  0.650043 1.287262 -0.645322
O  -1.602162 1.760192 1.326776
O  -4.941396 -1.260579 -0.292645
N  1.387086 -0.803931 0.082984
N  -0.881132 -0.240894 0.319344
C  2.748563 -0.658543 -0.478428
C  3.537063 0.59145 0.059267
C  3.638363 -1.900886 -0.155296
C  5.002472 0.124997 0.070928
C  4.912217 -1.342721 0.553257
C  0.419459 0.167024 -0.101915
C  -1.8862 0.636483 0.833676
C  -3.279109 0.100084 0.78814
C  -4.25737 0.641659 1.805597
C  -3.64685 -0.75664 -0.215627
C  -5.296087 -1.92174 -1.560655
H  2.65266 -0.514536 -1.573164
H  3.189758 0.789925 1.099446
H  3.91358 -2.419953 -1.090067
H  3.111085 -2.643758 0.475235
H  5.636868 0.761097 0.71027
H  5.394999 0.182804 -0.962144
H  4.784355 -1.372139 1.652331
H  5.816145 -1.927903 0.311081
H  1.205442 -1.58507 0.715893
H  2.399451 1.93219 -0.849575
H  -1.106641 -1.237431 0.287672
H  -5.297448 0.466485 1.488851
H  -4.081799 1.7230 1.939624
H  -4.112991 0.165206 2.794181
H  -2.959601 -1.052608 -1.0235
H  -4.582235 -2.734349 -1.797782
H  -5.321977 -1.189601 -2.388687
H  -6.298932 -2.34356 -1.402637
