program: Gaussian 09
title: 000273783
version: EM64L-G09RevD.01
frameworkgroup: C1[X(C20H16N2O4)]
method: RPBEPBE
basis: SDD
operation: Freq
keyword: #p
keyword: freq=noraman
keyword: PBEPBE/SDD
title: #p freq=noraman PBEPBE/SDD
converged: YES YES NO NO
title: Mulliken charges:
elementType: O O O O N N C C C C C C C C C C C C C C C C C C C C H H H H H H H H H H H H H H H H
charge: -0.408996 -0.240709 -0.413525 -0.242613 -0.417575 -0.405847 -0.045696 0.438806 0.400652 -0.555016 0.077079 0.091098 0.146583 -0.465965 -0.455026 0.198814 0.196932 -0.377019 -0.370226 0.209220 -0.357097 -0.359765 -0.277734 -0.285421 -0.218442 -0.219025 0.260372 0.273806 0.318986 0.315387 0.303692 0.304919 0.245024 0.247972 0.226535 0.227230 0.218463 0.218898 0.219593 0.220835 0.377723 0.377077
chargesum: 0.00000
title: Mulliken charges with hydrogens summed into heavy atoms:
elementType: O O O O N N C C C C C C C C C C C C C C C C C C C C
charge: -0.031274 -0.240709 -0.036448 -0.242613 -0.113882 -0.100928 -0.045696 0.438806 0.400652 -0.020839 0.077079 0.091098 0.146583 -0.146979 -0.139639 0.198814 0.196932 -0.131994 -0.122254 0.209220 -0.130561 -0.132535 -0.059270 -0.066524 0.001151 0.001811
polarizability: 2.44452080e+02 -5.82708658e+00 2.23605018e+02 -1.10290660e+01 -1.62293203e+01 2.31381622e+02
1716.lowfreq: -5.2055 -2.3433 -0.0003 0.0005 0.0008 5.8351 9.2369 27.3495 36.5461
frequency: 4.9571 27.3474 36.4946 49.9046 67.2155 71.0968 92.1102 120.0104 137.3728 147.1994 171.9977 180.4141 197.7689 221.4785 227.0015 237.5349 271.8026 332.1767 359.6104 374.5041 406.3659 411.9403 423.9918 427.5477 456.5666 473.0898 521.4355 523.4675 536.6892 547.1556 557.0513 575.6204 577.2525 584.3865 589.2977 601.9012 623.2134 637.2777 643.8186 656.8690 692.1499 746.6644 748.3348 751.7996 754.9800 760.3982 765.6560 771.9554 810.5092 828.9983 847.6603 851.5756 854.8606 856.5952 868.0403 870.7129 897.2832 932.3328 935.9105 943.8650 971.7591 975.2207 996.8417 1012.9499 1016.4371 1037.3623 1061.0434 1091.7497 1097.0465 1107.8253 1111.1183 1137.6792 1144.9436 1166.8612 1168.6464 1213.9625 1232.2308 1246.8245 1250.1433 1257.9807 1273.2587 1287.9164 1301.3979 1308.3396 1330.6394 1334.2338 1338.8876 1383.3214 1385.1666 1418.6984 1420.1127 1448.7193 1458.7081 1459.3955 1482.0647 1482.5753 1537.8371 1553.7031 1582.3843 1586.0270 1630.9203 1632.2853 1642.2844 1654.1173 3036.8276 3109.7834 3123.1817 3123.7937 3133.6610 3134.8218 3148.8365 3152.1625 3163.1603 3165.7778 3220.2912 3258.1602 3510.9147 3516.8770 3612.2652 3612.6951
redmass: 11.0656 5.5777 5.4518 5.1646 7.4261 5.9621 7.5767 6.1868 5.4311 5.7001 5.2105 5.4837 5.4342 4.2205 4.1781 6.6336 5.7878 6.3131 7.3628 6.0633 4.2467 2.8440 2.8869 3.0004 4.2582 4.0701 1.3915 1.3689 2.4763 6.1023 3.5680 2.9095 2.7541 1.8154 2.8954 2.7822 3.4979 4.7369 3.5650 2.9685 2.7941 5.0587 1.3582 1.3495 5.1656 4.9490 4.3463 4.1707 2.9302 3.6773 1.4504 1.4804 1.4033 1.6394 4.9698 5.0644 6.6135 1.3898 1.4371 3.5295 1.3072 1.2978 3.7226 2.1371 2.1645 3.5318 3.5756 2.5992 2.0534 1.7121 1.9817 1.4135 1.5141 1.0929 1.0998 1.3300 2.3616 1.6699 1.8673 1.9363 1.7088 2.4258 2.2353 1.9249 2.1387 1.9878 1.9472 3.8690 4.0099 2.5805 2.5643 1.1204 3.6631 3.8382 3.0254 3.0240 5.9423 5.5986 6.2102 6.2761 7.0093 6.8306 9.0811 8.1089 1.0583 1.1045 1.0850 1.0852 1.0894 1.0899 1.0948 1.0949 1.0999 1.0989 1.1001 1.0984 1.0639 1.0639 1.0809 1.0809
irintensity: 0.9941 0.0177 0.5925 0.6002 0.4063 1.7775 1.1737 0.6222 0.2717 1.5861 0.0686 1.6357 0.5307 7.2251 7.3570 0.4007 2.3386 2.6756 1.3304 0.3759 11.9502 3.5075 8.5346 6.2950 5.2237 2.0753 33.9945 67.4550 70.3740 10.3624 17.9490 4.8146 2.4656 141.9673 102.1086 67.5317 38.2903 10.2938 6.4097 13.8418 11.2503 21.1188 111.7904 90.8015 1.2727 2.2366 5.0481 7.7662 18.6023 30.1645 14.7116 5.4834 12.8460 3.2818 1.0776 2.6688 39.1043 4.8599 3.9472 11.8373 0.2850 0.3367 26.6037 15.3265 13.2536 175.1434 111.5009 132.4227 135.8918 14.3613 18.8513 15.7650 15.2712 1.9560 1.9790 4.0720 0.1914 15.0447 23.5924 8.4463 4.5374 2.6683 24.6293 17.6474 26.4135 42.5484 32.4277 54.0771 47.8914 6.5555 2.7000 13.8227 26.0003 16.5413 2.1874 2.0630 10.3354 2.5290 3.1196 1.6995 0.2727 2.2599 166.6126 220.6477 4.4291 2.5144 0.3849 0.3250 11.3004 15.0165 30.1127 30.3188 26.3594 21.0311 25.2079 9.0597 28.9723 35.2232 85.1788 41.2706
temp: 298.150 k
press: 1.00000 atm
elementType: 8 8 8 8 7 7 6 6 6 6 6 6 6 6 6 6 6 6 6 6 6 6 6 6 6 6 1 1 1 1 1 1 1 1 1 1 1 1 1 1 1 1
symmnumber: 1
zpe: 836477.1 jmol-1
zpe.correction: 0.318597 hartree
zpe.thermalcorrener: 0.340335 hartree
zpe.thermalcorrenthalpy: 0.341279 hartree
zpe.thermalcorrgfe: 0.265368 hartree
zpe.sumelectzpe: -1180.346381 hartree
zpe.sumelectthermal: -1180.324644 hartree
zpe.sumelectthermalent: -1180.323699 hartree
zpe.sumelectthermalfe: -1180.399610 hartree
dipole: 0.2798 -0.4648 0.1020
dipole: 0.5520
quadrupole: -131.0583 -140.6095 -140.8154
quadrupole: 4.0538 -6.1866 -10.2841
quadrupole: 6.4361 -3.1151 -3.3210 4.0538 -6.1866 -10.2841
hfenergy: -1180.6649782 hartree
pointgroup: C01 [X(C20H16N2O4)]
dipole: -0.0016674 -0.2100334 0.0552542 debye
polarizability: 229.9984192|-13.7706993|233.9478256|-16.971109|-6.6552769|235.4924746 unknown
InChI: InChI=1S/C20H16N2O4/c23-18(24)9-20(19(25)26,14-10-21-16-7-3-1-5-12(14)16)15-11-22-17-8-4-2-6-13(15)17/h1-8,10-11,21-23,25H,9H2
charge 0 multiplicity 1
42 atoms
O  2.461877 -1.852485 1.086515
O  0.826477 -1.744555 2.704738
O  1.227856 -4.382312 -0.020875
O  1.701709 -3.305185 -2.014188
N  2.268736 0.975239 -2.095018
N  -2.949612 -0.063066 1.983442
C  0.275508 -1.124013 0.32029
C  1.051675 -0.082082 -0.483746
C  -1.07172 -0.555198 0.779123
C  -0.086222 -2.42757 -0.522848
C  1.36358 1.262028 -0.01913
C  -2.025205 0.121377 -0.096536
C  1.158252 -1.584605 1.509587
C  1.626319 -0.21846 -1.746269
C  -1.681747 -0.65281 2.032818
C  2.1306 1.902353 -1.05503
C  -3.193227 0.417209 0.692655
C  1.078155 1.989342 1.167895
C  -2.020871 0.511907 -1.46465
C  1.039051 -3.352252 -0.952434
C  2.614114 3.223768 -0.938659
C  -4.329686 1.069359 0.166293
C  1.560581 3.306042 1.292658
C  -3.151663 1.158549 -1.997823
C  2.320358 3.918341 0.251943
C  -4.296567 1.435012 -1.193672
H  -0.608551 -2.08388 -1.431202
H  -0.790768 -3.01459 0.087508
H  1.661562 -1.088505 -2.398709
H  -1.29417 -1.093714 2.945932
H  2.773392 1.13163 -2.964293
H  -3.588317 0.009338 2.771895
H  0.481733 1.53719 1.966963
H  -1.140515 0.335323 -2.089791
H  3.195931 3.69597 -1.738359
H  -5.206289 1.28508 0.787654
H  1.346361 3.877215 2.202877
H  -3.152246 1.4650 -3.049823
H  2.678962 4.94592 0.379803
H  -5.159392 1.943018 -1.638749
H  2.986661 -2.185256 1.864107
H  1.970715 -4.96857 -0.331294
