program: Gaussian 09
title: 000273769
version: EM64L-G09RevD.01
frameworkgroup: C1[X(C19H13NO4)]
method: RPBEPBE
basis: SDD
operation: Freq
keyword: #p
keyword: freq=noraman
keyword: PBEPBE/SDD
title: #p freq=noraman PBEPBE/SDD
converged: YES YES NO NO
title: Mulliken charges:
elementType: O O O O N C C C C C C C C C C C C C C C C C C C H H H H H H H H H H H H H
charge: -0.299974 -0.253300 -0.156676 -0.209266 -0.281334 0.081995 0.134692 0.306165 0.048146 -0.108613 -0.200002 0.351890 0.256269 -0.211377 -0.350643 0.145603 -0.377434 -0.380733 -0.216618 -0.195340 -0.233270 -0.231653 -0.259420 -0.664735 0.318829 0.289927 0.289198 0.291455 0.238489 0.244502 0.238471 0.239503 0.242436 0.221784 0.220222 0.215657 0.255153
chargesum: 0.00000
title: Mulliken charges with hydrogens summed into heavy atoms:
elementType: O O O O N C C C C C C C C C C C C C C C C C C C
charge: -0.299974 -0.253300 -0.156676 -0.209266 -0.281334 0.081995 0.134692 0.306165 0.048146 -0.108613 -0.200002 0.351890 0.256269 0.107452 -0.060716 0.145603 -0.088236 -0.089278 0.021871 0.049162 0.005200 0.007850 0.204800 0.026298
polarizability: 3.77614876e+02 3.00983999e+01 2.91251468e+02 -7.16609941e+00 2.91874742e+00 9.68882630e+01
1716.lowfreq: -8.5913 -3.1891 -0.0008 -0.0007 -0.0006 3.2529 24.1108 48.7174 50.4785
frequency: 23.9776 48.7162 50.4744 54.7579 84.4689 111.6893 117.4401 134.6873 136.5035 166.2584 188.7121 210.0764 237.3839 267.1317 286.4959 304.7785 309.0628 318.3509 362.1991 377.8094 412.3303 418.8959 434.1113 448.3213 456.5577 475.3989 496.5948 565.6088 593.7434 612.5586 637.3214 658.7969 680.5181 704.4360 707.8514 720.1815 727.5165 741.9746 763.5985 781.9909 804.7325 808.8668 824.1206 839.8146 861.3510 872.1542 881.3600 926.2248 959.4415 973.4490 991.7511 994.2802 994.6789 1012.2078 1017.6587 1023.0321 1046.9239 1068.4545 1085.3691 1094.3752 1133.1529 1148.0666 1153.8503 1171.0762 1174.4657 1228.5287 1234.5647 1275.3694 1277.2754 1279.2363 1332.6050 1348.8430 1364.0037 1388.2352 1389.9006 1393.9896 1430.3016 1436.7154 1454.6623 1457.9782 1463.2567 1467.6774 1474.1359 1483.8727 1508.0441 1531.7398 1539.5253 1558.0174 1592.1408 1610.4248 1627.8898 1639.7538 2990.5630 3031.3856 3083.6610 3093.1200 3117.9679 3135.7215 3150.0048 3158.7772 3160.0506 3170.4078 3177.6308 3194.6510 3205.5608
redmass: 4.5426 3.1448 6.3577 6.6183 4.9818 3.6994 6.2418 5.0478 5.8878 4.6204 6.0570 1.5181 3.3032 5.2020 7.5506 4.8196 5.7047 4.4886 11.1294 7.1711 5.1183 3.4664 4.0880 4.2724 4.1461 10.7094 7.0981 4.1618 7.0258 6.9136 6.6208 6.6225 6.6152 4.2987 5.6546 4.0059 4.8998 4.1773 2.1643 1.8989 1.8310 1.4704 3.7068 4.0592 4.9944 6.9740 1.3668 1.6015 7.1862 1.3531 2.1080 1.4377 1.7302 1.3593 2.5110 2.9168 2.3990 4.2416 2.5049 2.1793 1.6510 1.8612 1.6516 1.1103 1.5981 2.3567 3.4365 2.1130 1.7032 1.1952 2.3686 1.5344 2.5425 1.2344 6.3293 6.6858 2.9983 2.5823 1.4724 2.6567 1.0508 3.3240 5.7254 1.0605 4.5913 6.9897 8.1803 9.7951 8.2306 6.9533 6.5323 10.3956 1.0361 1.0592 1.0980 1.1024 1.1062 1.0861 1.0900 1.0890 1.0945 1.1004 1.0917 1.0999 1.0962
irintensity: 2.0850 0.4297 2.6525 2.7455 0.1993 0.3623 1.3645 0.2590 1.5898 2.3460 0.3270 1.5459 0.8218 0.3229 3.3729 3.5437 3.4284 8.4350 23.3492 7.2451 1.0681 0.7445 7.2577 2.1743 8.1909 1.4073 0.9536 1.0506 8.7149 6.1583 0.8343 3.6099 3.3032 8.9278 7.9554 19.8010 18.6308 30.2202 57.5500 47.2150 41.5079 0.3152 16.4608 2.3323 2.4088 16.1812 0.8050 0.0644 97.1872 4.2638 3.7750 5.4408 3.0721 0.3258 79.1421 40.9166 105.6645 132.6532 108.7726 6.5087 8.4138 159.9945 1.3997 16.0171 23.1874 85.4778 356.7603 70.5961 3.1987 2.0371 51.6119 6.1041 39.4239 27.7851 17.7172 56.5643 33.5594 5.8506 12.8229 74.8034 11.7047 64.5509 36.7290 14.0738 92.8610 27.6355 253.4302 134.8409 43.1766 2.0382 15.5048 221.0789 22.9891 34.7600 40.3924 5.1747 28.6693 3.8776 5.8538 9.3174 1.8351 36.6139 4.7546 11.2766 6.2719
temp: 298.150 k
press: 1.00000 atm
elementType: 8 8 8 8 7 6 6 6 6 6 6 6 6 6 6 6 6 6 6 6 6 6 6 6 1 1 1 1 1 1 1 1 1 1 1 1 1
symmnumber: 1
zpe: 718646.6 jmol-1
zpe.correction: 0.273718 hartree
zpe.thermalcorrener: 0.293170 hartree
zpe.thermalcorrenthalpy: 0.294114 hartree
zpe.thermalcorrgfe: 0.224928 hartree
zpe.sumelectzpe: -1085.850629 hartree
zpe.sumelectthermal: -1085.831177 hartree
zpe.sumelectthermalent: -1085.830233 hartree
zpe.sumelectthermalfe: -1085.899419 hartree
dipole: 2.2097 3.1766 -0.0854
dipole: 3.8705
quadrupole: -100.7317 -135.1731 -141.8130
quadrupole: 12.0092 -1.7714 1.3450
quadrupole: 25.1742 -9.2671 -15.9071 12.0092 -1.7714 1.3450
hfenergy: -1086.124347 hartree
pointgroup: C01 [X(C19H13N1O4)]
dipole: 0.9413646 1.1907806 -0.1212058 debye
polarizability: 379.4038819|24.0195048|287.828624|-22.9918082|-3.8060901|98.5221011 unknown
InChI: InChI=1S/C19H13NO4/c1-2-24-19(23)14-13-9-5-6-10-20(13)16-15(14)17(21)11-7-3-4-8-12(11)18(16)22/h3-10H,2H2,1H3
charge 0 multiplicity 1
37 atoms
O  3.457339 -1.350977 -0.832633
O  -2.173103 2.707537 0.017101
O  -0.807421 -2.655885 -0.444828
O  2.004076 -2.64754 0.462229
N  0.659496 1.799629 -0.220621
C  -0.487314 0.992444 -0.130998
C  -0.067379 -0.36501 -0.152782
C  1.809474 0.959703 -0.303209
C  1.358299 -0.401052 -0.241653
C  -1.854988 1.464025 -0.015834
C  -1.087582 -1.445221 -0.19784
C  -2.881288 0.376277 0.083013
C  -2.514946 -1.002275 0.004561
C  0.748343 3.187399 -0.231271
C  3.085685 1.57712 -0.403909
C  2.241905 -1.582961 -0.149142
C  -4.24081 0.73492 0.243408
C  -3.520765 -1.994661 0.090755
C  2.001136 3.778847 -0.327697
C  3.18148 2.971724 -0.415987
C  -5.233866 -0.262051 0.335014
C  -4.872689 -1.630145 0.259365
C  4.449056 -2.470024 -0.786199
C  5.314681 -2.388707 0.474729
H  -0.203099 3.717829 -0.16026
H  3.958818 0.92906 -0.488619
H  -4.490438 1.799646 0.292136
H  -3.216011 -3.043681 0.019563
H  2.066522 4.86962 -0.336516
H  4.1611 3.451886 -0.4986
H  -6.28416 0.020965 0.462799
H  -5.643494 -2.404941 0.32992
H  3.896788 -3.424768 -0.829139
H  5.038815 -2.329614 -1.706395
H  6.083256 -3.183537 0.450025
H  5.830955 -1.414881 0.543063
H  4.70093 -2.534096 1.37925
