program: Gaussian 09
title: 000026324
version: EM64L-G09RevD.01
frameworkgroup: C1[X(C13H19NO3)]
method: RPBEPBE
basis: SDD
operation: Freq
keyword: #p
keyword: freq=noraman
keyword: PBEPBE/SDD
title: #p freq=noraman PBEPBE/SDD
converged: YES YES NO NO
title: Mulliken charges:
elementType: O O O N C C C C C C C C C C C C C H H H H H H H H H H H H H H H H H H H
charge: -0.237573 -0.284895 -0.402402 -0.143327 -0.331581 -0.370320 0.122646 0.299037 -0.676169 -0.659092 -0.449558 -0.397874 0.228955 0.137631 -0.356063 -0.245645 -0.683538 0.253415 0.195128 0.254568 0.222239 0.259291 0.201692 0.263208 0.215685 0.219260 0.213718 0.219977 0.265890 0.221398 0.203615 0.209857 0.204339 0.236151 0.233994 0.356340
chargesum: 0.00000
title: Mulliken charges with hydrogens summed into heavy atoms:
elementType: O O O N C C C C C C C C C C C C C
charge: -0.237573 -0.284895 -0.046061 -0.143327 0.116962 0.106487 0.122646 0.299037 0.004416 -0.006136 -0.190267 -0.131983 0.228955 0.137631 -0.134665 0.167828 -0.009053
polarizability: 2.15623873e+02 2.94990450e+00 1.81025739e+02 -7.56766681e+00 -1.85509762e+00 1.03010562e+02
1716.lowfreq: -7.1208 -6.7881 0.0002 0.0006 0.0006 1.9649 27.8654 45.5112 61.5602
frequency: 27.6449 45.5076 61.5559 77.9922 86.1294 109.2186 115.8433 120.3044 149.8977 160.0081 191.9850 200.4635 216.1497 240.8116 271.9290 295.4457 306.7875 317.8918 334.6530 340.8059 371.6706 390.7002 454.9191 460.9342 487.9785 521.4251 553.8910 599.6781 610.9023 662.1172 711.2330 745.3580 765.5668 772.8083 780.1302 808.3783 821.9811 830.2339 866.9324 881.4946 930.0854 933.5660 952.8583 1011.0807 1033.2491 1067.9082 1075.7263 1084.8388 1086.9451 1099.7329 1116.7534 1134.7803 1161.1622 1175.6675 1204.8953 1223.7805 1262.8438 1263.7154 1275.1169 1297.7043 1301.3029 1347.2364 1359.4883 1366.7161 1380.2557 1387.5069 1393.0405 1399.2386 1407.2580 1411.7354 1451.1731 1459.6648 1464.5073 1469.3726 1473.8228 1477.3442 1483.3522 1487.9704 1488.3331 1510.9183 1545.7865 1597.4249 1610.4709 2945.5614 2965.0667 2983.9120 2984.6887 2998.0279 3003.6091 3012.2775 3067.6396 3068.2724 3081.9006 3085.3333 3091.3540 3095.0674 3106.6401 3108.4615 3116.0110 3168.8426 3172.0354 3571.8528
redmass: 3.6882 3.8930 4.0281 3.6684 2.7147 3.3189 2.1041 2.8822 2.3519 2.1262 1.4961 1.8069 2.0750 1.2174 4.1398 3.6602 4.7188 3.2924 3.5346 2.9306 1.1866 3.0038 3.3472 4.9688 3.3052 4.0393 5.7494 3.9880 5.4460 4.9300 4.9511 3.4092 1.4001 3.3501 1.3113 1.5533 2.4825 1.1827 2.5714 1.5302 1.4076 2.2436 2.8661 2.7824 2.6585 2.2368 1.9032 2.1357 2.0008 1.7754 2.1987 1.4355 1.2180 2.0118 2.9551 2.4823 1.7642 1.2039 2.0278 1.3939 1.3852 1.2371 1.3144 1.3866 1.2202 1.2393 2.9056 1.3676 2.8671 4.1744 1.1362 1.0396 1.0563 1.0555 1.0808 1.0675 1.0664 1.0673 1.0846 3.0513 6.0676 6.3850 6.9053 1.0554 1.0701 1.0357 1.0363 1.0363 1.1070 1.0623 1.0989 1.0945 1.0989 1.0988 1.0981 1.0988 1.1015 1.1013 1.0899 1.0928 1.0913 1.0660
irintensity: 0.7602 0.4801 1.1329 3.8467 0.7877 6.3851 2.4281 0.2836 0.7849 2.5077 1.0011 2.6791 0.4337 1.3123 2.7840 2.9694 0.1918 4.0326 3.8310 9.4168 126.3164 9.9953 1.7817 7.1971 2.7027 11.6339 3.4187 7.7068 9.8511 2.5081 25.7603 13.9266 6.6607 29.6533 11.3214 35.0816 9.0477 12.0939 15.5930 10.8434 4.9602 8.8226 26.9471 4.3520 48.6835 12.7222 0.9909 35.8597 291.0968 10.1623 22.6399 4.3876 28.4004 95.4757 7.6624 120.6405 24.5166 3.4819 305.5949 7.1528 56.2335 2.2517 18.1026 8.7535 29.5571 18.8771 72.0263 37.2681 57.7161 81.6609 30.0247 11.4742 11.6062 19.1317 18.0913 13.4574 5.4169 18.7177 13.4181 45.4646 224.9418 41.8884 37.5613 40.9130 39.1019 19.6373 39.4388 24.5765 38.9183 43.3412 14.5812 9.9850 44.0650 40.7966 37.6030 24.7721 27.1425 31.1587 20.2585 6.7926 2.4409 47.5605
temp: 298.150 k
press: 1.00000 atm
elementType: 8 8 8 7 6 6 6 6 6 6 6 6 6 6 6 6 6 1 1 1 1 1 1 1 1 1 1 1 1 1 1 1 1 1 1 1
symmnumber: 1
zpe: 783926.3 jmol-1
zpe.correction: 0.298582 hartree
zpe.thermalcorrener: 0.317188 hartree
zpe.thermalcorrenthalpy: 0.318132 hartree
zpe.thermalcorrgfe: 0.251478 hartree
zpe.sumelectzpe: -785.889421 hartree
zpe.sumelectthermal: -785.870815 hartree
zpe.sumelectthermalent: -785.869871 hartree
zpe.sumelectthermalfe: -785.936525 hartree
dipole: -0.3153 2.8349 2.3486
dipole: 3.6949
quadrupole: -103.8437 -87.1375 -105.8023
quadrupole: 11.2704 5.5336 -7.3571
quadrupole: -4.9159 11.7903 -6.8745 11.2704 5.5336 -7.3571
hfenergy: -786.1880027 hartree
pointgroup: C01 [X(C13H19N1O3)]
dipole: -0.1580534 1.0547646 0.987751 debye
polarizability: 215.0050404|4.9662236|181.3658834|-9.1137481|2.1338543|103.2892502 unknown
InChI: InChI=1S/C13H19NO3/c1-4-14(5-2)13(16)10-7-8-11(15)12(9-10)17-6-3/h7-9,15H,4-6H2,1-3H3
charge 0 multiplicity 1
36 atoms
O  -3.070229 0.481144 0.134414
O  2.509541 -1.391112 -1.214816
O  -3.611192 -2.090691 0.637584
N  2.407551 0.548069 0.065022
C  3.789965 0.863599 -0.381165
C  1.916984 1.279893 1.257122
C  1.837629 -0.623078 -0.446281
C  0.411657 -0.966637 -0.099698
C  4.871821 0.104746 0.418853
C  1.53986 2.752023 0.982214
C  -0.636498 -0.006703 -0.101379
C  0.099947 -2.326664 0.123153
C  -1.975096 -0.388942 0.13584
C  -2.271053 -1.762174 0.394897
C  -1.230805 -2.716014 0.381459
C  -2.809735 1.903973 -0.159646
C  -4.159425 2.614269 -0.111162
H  3.866119 0.587124 -1.445855
H  3.934866 1.956171 -0.293795
H  1.051589 0.737865 1.670381
H  2.710963 1.250577 2.032102
H  -0.403967 1.036211 -0.330842
H  4.813533 0.325426 1.500882
H  4.753272 -0.981118 0.269332
H  5.879044 0.396439 0.068538
H  2.401568 3.330396 0.603925
H  0.730585 2.828229 0.2343
H  1.196163 3.234005 1.916084
H  0.901614 -3.068872 0.07429
H  -1.466116 -3.772413 0.566622
H  -2.109091 2.316381 0.59726
H  -2.341641 1.994922 -1.162012
H  -4.030234 3.691174 -0.324069
H  -4.848584 2.187556 -0.859254
H  -4.620509 2.50475 0.885029
H  -3.702595 -3.066026 0.781372
