program: Gaussian 09
title: 000273810
version: EM64L-G09RevD.01
frameworkgroup: C1[X(C27H30N2O)]
method: RPBEPBE
basis: SDD
operation: Freq
keyword: #p
keyword: freq=noraman
keyword: PBEPBE/SDD
title: #p freq=noraman PBEPBE/SDD
converged: YES YES NO NO
title: Mulliken charges:
elementType: O N N C C C C C C C C C C C C C C C C C C C C C C C C C C C H H H H H H H H H H H H H H H H H H H H H H H H H H H H H H
charge: -0.210573 -0.465480 -0.466039 -0.207311 -0.332904 -0.434545 0.297898 0.307799 -0.425470 0.209079 -0.401927 -0.535675 0.166794 0.157653 0.052921 0.080966 0.197019 0.202239 -0.538555 -0.539191 -0.394787 -0.424649 -0.373933 -0.367119 -0.679073 -0.676835 -0.300616 -0.274505 -0.229671 -0.226212 0.215059 0.215862 0.217588 0.240957 0.216935 0.191235 0.216117 0.214706 0.238625 0.219949 0.294987 0.296023 0.255891 0.202013 0.199463 0.260156 0.210376 0.234774 0.227551 0.225966 0.203426 0.213936 0.271686 0.254501 0.222202 0.199483 0.216402 0.218316 0.219830 0.218688
chargesum: 0.00000
title: Mulliken charges with hydrogens summed into heavy atoms:
elementType: O N N C C C C C C C C C C C C C C C C C C C C C C C C C C C
charge: -0.210573 -0.170493 -0.170016 0.007748 -0.117042 0.024000 0.297898 0.307799 -0.017301 0.209079 0.028897 -0.077101 0.166794 0.157653 0.052921 0.080966 0.197019 0.202239 -0.080650 -0.079573 -0.184411 -0.189875 -0.146382 -0.141153 0.009975 -0.000650 -0.084213 -0.056189 -0.009842 -0.007523
polarizability: 3.79091116e+02 -8.26261265e+00 2.53003322e+02 -4.01740380e+01 3.02123702e+00 2.83379298e+02
1716.lowfreq: -10.7657 -1.4139 -0.0007 0.0005 0.0008 6.6007 14.1801 27.2002 36.5803
frequency: 12.8127 27.0391 36.5600 42.4127 51.6664 57.0828 68.1970 75.7186 83.9010 93.6484 103.8102 132.4388 146.2760 159.9733 166.6665 176.2840 198.7362 210.9331 215.2727 219.9246 238.1369 273.9550 291.4378 294.0791 308.4827 326.9080 329.5290 386.7996 398.4538 412.7842 435.7556 447.1876 455.0375 471.4286 496.4184 501.1182 502.0844 510.4435 518.0184 533.1849 578.2507 580.4397 582.2350 599.0458 618.6473 649.7599 653.6149 675.0645 689.0374 694.8559 735.4072 745.8318 748.2134 750.0435 757.6400 769.8924 782.4104 788.6471 804.1154 832.3130 836.5412 839.6804 848.0614 853.0947 859.2021 881.9412 896.8922 904.8537 919.9695 924.1986 928.2387 949.8783 959.5842 967.5011 975.3148 986.8933 1013.1481 1017.7866 1029.2204 1041.1345 1052.3857 1056.2212 1061.2207 1064.5027 1074.8102 1079.5874 1094.1329 1107.5534 1111.0637 1117.1063 1137.8469 1155.9042 1168.5784 1173.8360 1185.2846 1213.3197 1218.6993 1219.9580 1225.2489 1238.4316 1240.1021 1258.7103 1263.9989 1265.7733 1275.8197 1295.3668 1296.9349 1306.4514 1308.4734 1319.3474 1323.9002 1326.0651 1335.2018 1339.2262 1340.3011 1350.3260 1360.7763 1383.5032 1394.1103 1404.7706 1407.8321 1422.2127 1430.5593 1452.9772 1462.6780 1464.3493 1465.5020 1467.1034 1468.8695 1472.9950 1474.0261 1475.7105 1478.8367 1482.0291 1487.4245 1488.7304 1497.6993 1562.2243 1570.2697 1575.5856 1586.4024 1622.7651 1629.1446 1629.8091 2968.7994 2970.5070 2978.3469 2981.0975 2981.4775 2981.8123 2983.6668 2985.2913 2986.9049 3021.0471 3033.9543 3046.2699 3047.2012 3056.5437 3067.5369 3077.0486 3079.0480 3087.3187 3091.8218 3096.5325 3116.8300 3119.0921 3124.4527 3126.5729 3139.3127 3141.0842 3159.3736 3159.8676 3598.9852 3601.5585
redmass: 4.5676 4.4859 4.3518 4.2522 4.4633 3.2355 3.2416 2.9800 3.6416 3.7246 4.4727 4.9416 3.8987 3.1055 3.8441 1.3810 1.5285 2.1790 3.7401 4.1046 2.4415 2.8378 2.3547 2.1470 3.1585 3.8151 3.9885 4.0254 4.2080 2.9506 3.1273 3.4732 3.7535 3.0037 2.7130 2.7061 3.0174 1.5846 1.2204 3.4507 3.2960 3.9889 3.6087 5.2517 6.0553 4.6752 5.1971 3.2835 4.2000 4.3622 1.7577 1.7798 1.6720 3.1714 3.9212 2.2196 1.7709 1.3850 1.8835 2.0463 3.4419 1.5837 1.5439 2.8333 3.4475 1.7939 3.5543 3.1011 1.4003 2.4687 1.3835 2.4559 1.2909 1.2926 2.6193 2.8247 2.0504 1.9542 1.8005 1.7712 1.6369 2.1353 1.9571 1.8299 1.9858 1.6402 2.4916 2.4366 1.8251 1.9773 1.7920 1.7190 1.1740 1.4518 1.3622 1.8019 1.4555 1.4556 1.5456 1.5478 1.3417 1.4840 1.6758 1.4933 1.4153 1.4181 1.3606 1.6129 1.4012 2.1318 1.7052 2.2139 1.4281 1.4804 1.8582 1.5267 1.3689 1.2386 1.4137 2.8716 5.3751 2.4903 2.9356 1.0981 2.8589 1.3540 2.7559 1.0908 1.0581 1.0550 1.2345 1.0949 1.9495 2.1509 1.3940 1.1336 1.0837 6.7173 7.0480 5.8308 6.0963 9.1802 6.8543 6.8205 1.0636 1.0692 1.0479 1.0393 1.0521 1.0604 1.0628 1.0694 1.0723 1.0812 1.0959 1.1016 1.0956 1.1015 1.0959 1.0997 1.1002 1.0945 1.1014 1.0995 1.0855 1.0842 1.0884 1.0886 1.0944 1.0943 1.0998 1.0999 1.0801 1.0803
irintensity: 0.5046 0.7950 0.8715 0.2193 1.4672 0.5427 1.3640 0.9615 0.1474 0.7435 0.7380 0.4004 0.8371 1.4818 0.6940 0.8048 0.1875 0.2108 3.5182 5.6530 2.1691 0.2497 2.1245 0.5217 1.2409 0.5166 0.2300 0.3593 0.8797 1.6397 8.7129 4.0669 0.0929 3.2645 7.2961 12.9194 10.6287 60.0474 66.4423 14.4212 5.0757 3.3147 1.5031 14.1612 2.6481 2.9493 0.6844 2.9015 8.8395 8.2506 42.7192 38.7492 89.2856 0.3338 1.6027 30.1152 18.2837 0.3797 4.2185 8.1895 0.2685 0.4802 0.5551 2.7943 2.8689 4.0713 0.9970 1.1079 2.6671 3.1751 2.7519 2.3123 0.0468 0.0437 0.8385 0.2090 8.7806 10.6067 20.2650 7.0119 7.5452 2.0311 16.2906 16.6627 5.5128 11.5495 2.9705 6.1267 1.4596 41.4260 12.8402 8.0091 0.6897 7.2611 8.9822 7.8989 6.2973 5.3454 3.4978 11.4221 11.1394 7.5753 3.9473 13.4633 18.4683 15.1554 12.5796 2.2792 0.8737 25.6853 11.4401 22.9711 1.2380 0.6796 15.9945 4.6654 3.4713 12.5182 12.0443 25.1946 39.8818 12.9684 21.8535 12.3449 36.4942 23.5491 2.7524 13.5756 6.0985 4.9280 7.1293 5.0991 4.8636 18.3042 6.4579 10.2373 11.9362 11.7571 8.4961 9.6482 4.6693 123.7658 2.1543 1.2823 22.9383 53.0311 28.2680 36.6930 46.1656 39.7465 35.1227 9.6351 3.8356 18.7576 53.5357 34.9459 5.3900 33.8234 17.0419 46.9034 28.2097 26.3775 17.6072 28.3879 8.1442 6.6370 2.7909 5.5292 37.3530 49.7335 42.0829 27.2158 42.2023 45.2447
temp: 298.150 k
press: 1.00000 atm
elementType: 8 7 7 6 6 6 6 6 6 6 6 6 6 6 6 6 6 6 6 6 6 6 6 6 6 6 6 6 6 6 1 1 1 1 1 1 1 1 1 1 1 1 1 1 1 1 1 1 1 1 1 1 1 1 1 1 1 1 1 1
symmnumber: 1
zpe: 1322526.3 jmol-1
zpe.correction: 0.503724 hartree
zpe.thermalcorrener: 0.531234 hartree
zpe.thermalcorrenthalpy: 0.532178 hartree
zpe.thermalcorrgfe: 0.444643 hartree
zpe.sumelectzpe: -1229.472213 hartree
zpe.sumelectthermal: -1229.444703 hartree
zpe.sumelectthermalent: -1229.443759 hartree
zpe.sumelectthermalfe: -1229.531294 hartree
dipole: -0.0709 -1.6411 -2.3064
dipole: 2.8316
quadrupole: -175.2795 -164.9918 -167.3444
quadrupole: -2.6099 5.1552 -7.0905
quadrupole: -6.0743 4.2134 1.8609 -2.6099 5.1552 -7.0905
hfenergy: -1229.9759371 hartree
pointgroup: C01 [X(C27H30N2O1)]
dipole: -0.1354395 -0.4280932 -1.0195332 debye
polarizability: 372.8327886|-20.2285878|256.4922604|-44.0586905|4.0570173|286.1486876 unknown
InChI: InChI=1S/C27H30N2O/c1-3-20-25(17-11-5-8-14-22(17)28-20)27(19-13-7-10-16-24(19)30)26-18-12-6-9-15-23(18)29-21(26)4-2/h5-6,8-9,11-12,14-15,19,27-29H,3-4,7,10,13,16H2,1-2H3
charge 0 multiplicity 1
60 atoms
O  1.177507 2.04534 2.194644
N  2.177795 -2.361348 1.242863
N  -2.787287 -0.98203 -2.052487
C  0.3444 1.837261 -0.114845
C  -0.150581 0.410795 0.281841
C  -0.791065 2.858624 -0.459852
C  0.992898 -0.600442 0.387299
C  -1.360371 -0.076906 -0.512064
C  -0.195521 4.219389 -0.890389
C  1.162148 2.487932 1.013382
C  0.724307 4.819053 0.199601
C  1.829026 3.804861 0.633017
C  1.000663 -1.605207 1.365683
C  -1.432106 -0.706926 -1.76459
C  2.232835 -0.742738 -0.371952
C  -2.728091 0.035406 -0.02066
C  2.952924 -1.861851 0.195785
C  -3.602392 -0.541679 -1.008232
C  0.028712 -1.874357 2.484875
C  -0.376732 -1.168999 -2.735939
C  2.842196 -0.07473 -1.475993
C  -3.299705 0.561366 1.16944
C  4.202206 -2.306416 -0.284734
C  -5.003219 -0.597784 -0.8449
C  0.402378 -1.109376 3.787441
C  -0.039922 -2.679605 -2.59552
C  4.091815 -0.509255 -1.959837
C  -4.696879 0.503989 1.343634
C  4.771403 -1.615123 -1.372652
C  -5.541566 -0.067235 0.34632
H  0.989165 1.789084 -1.011769
H  -0.516277 0.539431 1.320341
H  -1.449992 2.993575 0.421124
H  -1.41846 2.4322 -1.263123
H  -1.011904 4.929723 -1.123337
H  0.385721 4.082257 -1.826064
H  0.118669 5.086133 1.088305
H  1.199902 5.750855 -0.160237
H  2.408877 4.18745 1.490112
H  2.519287 3.636641 -0.217528
H  2.426316 -3.145795 1.841809
H  -3.108158 -1.440848 -2.902697
H  -0.985662 -1.579633 2.162299
H  -0.019109 -2.962597 2.692158
H  -0.712478 -0.964377 -3.773808
H  0.547475 -0.589995 -2.585677
H  2.358059 0.778033 -1.963601
H  -2.666288 1.004739 1.947213
H  4.717538 -3.159125 0.172577
H  -5.654397 -1.03883 -1.608441
H  1.375473 -1.452127 4.185088
H  -0.363631 -1.27163 4.567847
H  0.488283 -0.027115 3.586985
H  0.355834 -2.88698 -1.586768
H  0.72666 -2.975731 -3.3343
H  -0.934124 -3.31128 -2.752099
H  4.55184 0.013631 -2.806143
H  -5.14653 0.904622 2.259171
H  5.742878 -1.929126 -1.770073
H  -6.624843 -0.095493 0.509359
