program: Gaussian 09
title: 000273704
version: EM64L-G09RevD.01
frameworkgroup: C1[X(C14H10O2)]
method: RPBEPBE
basis: SDD
operation: Freq
keyword: #pfreq=noraman
keyword: PBEPBE/SDD
title: #p freq=noraman PBEPBE/SDD
converged: NO NO NO NO
title: Mulliken charges:
elementType: O O C C C C C C C C C C C C C C H H H H H H H H H H
charge: -0.417725 -0.252831 -0.388947 -0.388938 -0.292863 0.436689 0.436701 -0.232249 0.188777 0.477540 -0.466155 -0.466153 -0.441639 -0.441638 -0.217026 -0.217025 0.292841 0.292861 0.291785 0.250477 0.250479 0.239812 0.239813 0.223419 0.223419 0.378578
chargesum: 0.00000
title: Mulliken charges with hydrogens summed into heavy atoms:
elementType: O O C C C C C C C C C C C C C C
charge: -0.039147 -0.252831 -0.096106 -0.096077 -0.001078 0.436689 0.436701 -0.232249 0.188777 0.477540 -0.215678 -0.215674 -0.201827 -0.201825 0.006393 0.006394
polarizability: 2.13427796e+02 2.66785730e-03 1.78475700e+02 -1.26557140e+01 7.35959406e-05 8.70047483e+01
1716.lowfreq: -6.7972 -0.0009 -0.0007 -0.0005 8.0614 12.3015 62.0139 78.1361 102.1451
frequency: 61.9331 78.1283 102.1311 171.0363 184.8658 198.5777 276.7840 291.0201 416.6747 422.0247 422.5634 466.3495 498.4278 527.9807 542.5819 579.7089 592.7091 621.8020 642.3068 660.3555 667.4814 702.8711 769.9298 783.9441 792.8117 823.5527 827.3496 850.7567 853.6697 887.8771 907.1258 925.0850 966.0934 977.6082 987.0338 1015.8529 1037.7907 1041.5231 1053.3642 1054.3842 1056.2947 1105.6638 1159.2449 1171.7502 1190.5447 1204.1827 1204.9211 1238.2137 1239.5815 1292.3192 1293.5565 1368.3401 1388.6624 1396.5534 1419.3182 1462.4098 1470.0498 1495.4512 1602.9138 1613.1270 1628.5403 1638.2515 3123.8683 3124.2344 3139.0330 3139.3882 3156.8208 3157.8695 3163.9380 3173.2924 3175.9664 3510.5490
redmass: 8.8504 5.9219 6.3747 4.0055 3.6561 7.1678 6.7450 3.3064 4.9990 4.0979 4.7086 3.2436 7.0715 3.7387 6.6122 5.0236 1.2479 3.8976 4.1304 4.2194 4.8345 4.5752 1.2846 2.2762 4.1631 2.5359 5.2995 5.1506 2.8081 2.2384 1.4065 1.5259 3.1863 1.3372 1.3669 2.6457 2.2613 1.2786 1.8340 1.4164 2.3205 1.8335 1.5882 1.1929 1.3044 1.3481 1.4570 1.7581 1.6890 2.3459 2.7782 2.8135 2.4009 3.7760 1.9658 7.5025 3.2609 4.6596 6.3030 8.4679 7.5622 8.1103 1.0863 1.0861 1.0927 1.0922 1.0985 1.0981 1.0907 1.0967 1.0899 1.0639
irintensity: 1.8157 0.3306 0.0655 4.1059 0.0657 5.2774 2.3648 0.0150 17.3699 0.0381 21.1132 0.2634 0.0462 0.0789 8.7997 17.1070 118.1593 1.1123 0.4377 0.9861 2.3008 44.5116 0.0052 57.4636 9.2009 66.2568 0.0034 0.4754 7.5178 11.7673 0.0105 2.3697 24.5881 0.0000 2.6280 0.8604 16.8539 14.4909 351.1812 0.7415 78.6035 3.2248 32.0745 0.0170 2.9544 4.5895 0.9997 3.5786 2.7351 0.5000 14.1004 13.8881 214.8329 0.0181 8.9260 5.4552 0.3659 8.8319 0.2675 3.4868 5.5540 349.0159 1.4383 0.0211 0.1360 35.5207 51.9504 13.5941 1.7354 0.5147 2.1635 38.3057
temp: 298.150 k
press: 1.00000 atm
elementType: 8 8 6 6 6 6 6 6 6 6 6 6 6 6 6 6 1 1 1 1 1 1 1 1 1 1
symmnumber: 1
zpe: 521505.5 jmol-1
zpe.correction: 0.198631 hartree
zpe.thermalcorrener: 0.210365 hartree
zpe.thermalcorrenthalpy: 0.211310 hartree
zpe.thermalcorrgfe: 0.160482 hartree
zpe.sumelectzpe: -688.842168 hartree
zpe.sumelectthermal: -688.830433 hartree
zpe.sumelectthermalent: -688.829489 hartree
zpe.sumelectthermalfe: -688.880317 hartree
dipole: -1.2679 -0.0003 0.9902
dipole: 1.6088
quadrupole: -84.2351 -81.1019 -97.8052
quadrupole: -0.0014 3.2022 0.0020
quadrupole: 3.4790 6.6122 -10.0912 -0.0014 3.2022 0.0020
hfenergy: -689.0407988 hartree
pointgroup: C01 [X(C14H10O2)]
dipole: 0.5003623 -0.0002799 -0.3876191 debye
dipolederiv: -0.7661928 -0.0001882 -0.5068703 -0.0001383 -0.3934924 -0.0000282 -0.7149637 -0.0001754 -1.0353637 -1.0741426 0.0001702 0.2321873 0.0003955 -0.3219146 -0.0003961 0.327789 -0.0001872 -0.8291051 0.2457317 0.0605012 0.0076197 0.1095909 -0.0374228 0.0490822 0.2034664 0.003368 0.1437499 0.2456843 -0.0605463 0.0076808 -0.1095306 -0.0373724 -0.0489908 0.2036062 -0.0033391 0.1438054 -1.2585796 0.0001727 -0.1660457 0.0000231 0.0798531 -0.0000649 -0.3830405 -0.0000168 -0.1288782 0.2202279 -0.0941847 -0.0089766 0.0160034 0.0066835 0.0329932 -0.0182566 0.0296309 -0.0530061 0.2201226 0.0941166 -0.0090355 -0.0161168 0.0066399 -0.0330108 -0.0182655 -0.0296434 -0.0529743 -0.2858876 0.0000447 0.0253592 -0.0000112 -0.0292546 -0.0000125 0.0360769 -0.0000205 -0.0616244 2.3146097 -0.0002253 0.2518064 -0.0004029 0.1830581 0.0004839 0.1463826 0.0004625 1.4323738 -0.0995634 0.0000212 0.0488197 0.0000328 0.1664991 -0.0000252 0.0466092 -0.0000224 0.0800431 -0.0541007 0.1227674 -0.0511589 0.1230472 0.0115734 -0.0347148 -0.0392942 -0.0227674 -0.1506882 -0.0541183 -0.1227783 -0.0510871 -0.1229998 0.0116574 0.0346423 -0.0392614 0.0226887 -0.1507127 0.0663847 -0.0560724 -0.0824711 0.0168224 -0.0637417 0.0027204 -0.0682446 0.019849 -0.1711246 0.066407 0.0560073 -0.0824998 -0.0168979 -0.0637465 -0.0027604 -0.0682441 -0.0198905 -0.1711081 0.041159 -0.0788947 -0.0519274 -0.1422603 0.0410169 0.0223956 -0.0390298 0.0199667 -0.1302652 0.041164 0.0788739 -0.0519728 0.1422497 0.0409508 -0.0224731 -0.0390913 -0.0200466 -0.1302448 -0.0132228 -0.0141063 0.0576867 -0.0088813 0.033718 0.0513554 0.0130338 0.051417 0.0625224 -0.0132097 0.0141488 0.0576662 0.0089048 0.0336756 -0.0513367 0.0129981 -0.0513956 0.0625894 0.0302008 0.0000187 0.0293898 -0.0000469 0.0945106 -0.0000445 0.0308945 -0.0000408 -0.0161378 0.0435689 -0.0951132 0.0366759 -0.072909 -0.051486 0.0240795 0.022291 0.0270265 0.143837 0.0436041 0.0951114 0.0366226 0.0728985 -0.0515406 -0.0239862 0.0222484 -0.0269293 0.1438622 -0.0968192 0.0404988 0.0678881 -0.017134 0.0745318 0.0047998 0.0693107 -0.0096674 0.140762 -0.0968219 -0.0404314 0.0679079 0.0172003 0.0745391 -0.0047784 0.0693029 0.0096885 0.1407589 0.0346972 0.0930959 0.0267151 0.1065649 -0.0961505 -0.0206491 0.0315155 -0.0245312 0.148873 0.0346596 -0.0931059 0.0267672 -0.1065724 -0.0960893 0.0207693 0.0315787 0.0246486 0.1488495 0.1644372 0.000098 0.0812525 0.0001678 0.3833042 -0.0000499 0.1605878 -0.0000727 0.2892064 unknown
polarizability: 213.5245156|-0.0101167|178.4756963|-12.162643|-0.0203749|86.9080315 unknown
InChI: InChI=1S/C14H10O2/c15-14(16)13-11-8-5-1-3-7-4-2-6-9(10(7)8)12(11)13/h1-6,11-13,15H
charge 0 multiplicity 1
26 atoms
O  -4.024001 -0.000153 -1.540642
O  -4.104843 0.000961 0.789104
C  -1.17509 -0.771217 0.755914
C  -1.174959 0.771577 0.75551
C  -1.948749 -0.000017 -0.363864
C  0.222361 -1.187214 0.384491
C  0.222581 1.187127 0.383892
C  0.986043 -0.000171 0.157929
C  -3.424959 0.000065 -0.268602
C  2.356064 -0.0004 -0.232401
C  0.842792 -2.428338 0.224795
C  0.843246 2.428052 0.223561
C  2.972596 -1.288836 -0.391473
C  2.972838 1.287839 -0.392134
C  2.228333 -2.458248 -0.163661
C  2.228791 2.457505 -0.164917
H  -1.788476 -1.339006 1.458927
H  -1.788249 1.33982 1.458239
H  -1.533722 -0.00034 -1.373842
H  0.303859 -3.367853 0.387795
H  0.30449 3.367752 0.386083
H  4.027582 -1.358188 -0.682283
H  4.027836 1.356847 -0.682981
H  2.716556 -3.43242 -0.282944
H  2.717194 3.431526 -0.284699
H  -5.013317 0.000232 -1.424098
