program: Gaussian 09
title: 000273662
version: EM64L-G09RevD.01
frameworkgroup: C1[X(C10H18N2O2)]
method: RPBEPBE
basis: SDD
operation: Freq
keyword: #p
keyword: freq=noraman
keyword: PBEPBE/SDD
title: #p freq=noraman PBEPBE/SDD
converged: NO YES NO NO
title: Mulliken charges:
elementType: O O N N C C C C C C C C C C H H H H H H H H H H H H H H H H H H
charge: -0.497889 -0.323219 -0.171085 -0.647625 -0.024285 -0.159931 -0.081230 -0.456929 -0.481570 -0.419888 -0.415404 -0.386121 -0.389722 0.207180 0.216546 0.265000 0.216131 0.203285 0.202137 0.197165 0.216588 0.192564 0.212144 0.209875 0.207579 0.213815 0.198018 0.268249 0.193517 0.351069 0.318408 0.365628
chargesum: 0.00000
title: Mulliken charges with hydrogens summed into heavy atoms:
elementType: O O N N C C C C C C C C C C
charge: -0.146819 -0.323219 -0.171085 0.036411 0.192261 0.105069 0.134901 -0.051507 -0.067816 -0.015180 0.002050 0.025711 0.072043 0.207180
polarizability: 1.42122712e+02 5.85258641e-01 1.25865545e+02 -1.96447269e+00 -3.55493649e+00 9.90606752e+01
1716.lowfreq: -11.0419 -0.0007 0.0003 0.0008 12.8148 18.5472 76.1354 91.3630 115.8868
frequency: 76.0123 91.3307 115.8751 133.8835 164.3926 195.9638 210.8522 255.7509 287.6251 326.4509 328.7994 348.1650 353.1004 403.9539 424.5152 456.9891 488.7276 498.6077 544.4325 571.6337 619.5735 626.1522 670.2816 726.8386 750.5416 793.9654 842.3869 858.3772 862.1093 897.2408 904.7993 909.5379 984.2259 985.8294 989.7004 1024.9847 1042.0975 1056.0796 1068.6026 1096.2416 1101.0740 1115.8582 1130.6671 1157.4296 1164.2246 1181.8320 1202.0981 1221.5531 1244.4828 1259.3216 1279.1491 1280.7978 1300.5129 1310.1409 1325.5614 1330.3683 1335.3072 1340.7976 1346.4945 1347.3773 1365.6257 1372.8322 1388.5744 1417.7913 1458.6623 1459.8903 1468.5037 1470.5047 1476.5973 1477.9419 1595.9732 1632.5553 2922.8622 2959.9858 2963.9665 2970.3301 2971.1321 2978.2406 2984.3007 2987.7120 3009.1687 3025.4903 3028.8830 3031.2398 3047.5518 3051.9562 3076.6954 3429.0289 3589.0230 3644.1417
redmass: 5.0395 7.3680 3.3832 2.6686 3.3348 1.1813 2.7166 2.4632 2.7881 4.8569 2.5741 2.1943 3.8483 2.6470 3.8010 2.9217 3.3976 2.7103 1.5340 1.6340 4.2571 2.4394 1.3036 3.5835 2.4225 2.5715 1.7291 2.0429 1.7564 2.0116 2.2390 2.6996 2.4419 2.5000 2.8046 2.0443 1.8218 1.6368 1.6911 1.7755 1.4846 2.1152 1.8306 1.5122 1.9651 1.4881 2.1992 1.3707 1.6948 1.3921 1.3700 1.3442 1.2164 1.2945 1.4018 1.3963 1.4470 1.4344 1.4133 1.4272 1.4602 1.4493 1.5335 3.2670 1.0857 1.0940 1.0915 1.0904 1.0934 1.0890 2.3993 1.6858 1.0710 1.0732 1.0778 1.0609 1.0610 1.0748 1.0656 1.0618 1.0844 1.1006 1.1002 1.0969 1.1025 1.1026 1.0909 1.0541 1.0665 1.0944
irintensity: 0.7059 3.8807 2.5949 3.7926 1.9905 112.4840 18.4275 5.4036 4.9048 1.4137 5.6864 0.8875 0.2515 10.5728 20.4538 4.7266 5.8820 2.2550 48.4453 47.2701 14.9524 12.1837 91.2110 101.8758 2.7392 6.7800 20.2891 4.3861 8.3806 0.6960 30.2698 5.1993 15.2202 26.9520 16.4276 36.3838 0.4387 3.2818 3.3634 24.2835 47.6572 3.1536 3.3309 1.9373 21.7862 2.9194 8.2900 2.1689 3.4108 2.1678 54.3013 21.6372 7.6557 20.8763 6.0928 2.8954 4.7588 5.7516 17.7241 1.5003 4.3437 6.7797 12.7504 260.3612 11.2741 6.4730 11.2000 10.5660 15.7967 15.1414 364.7645 192.1858 55.0002 1.5756 40.7743 32.8975 41.2212 51.4562 29.7583 33.2602 16.5948 3.4344 75.9976 63.2334 45.1055 94.3800 6.3750 108.3485 7.0513 67.6445
temp: 298.150 k
press: 1.00000 atm
elementType: 8 8 7 7 6 6 6 6 6 6 6 6 6 6 1 1 1 1 1 1 1 1 1 1 1 1 1 1 1 1 1 1
symmnumber: 1
zpe: 731031.0 jmol-1
zpe.correction: 0.278435 hartree
zpe.thermalcorrener: 0.291668 hartree
zpe.thermalcorrenthalpy: 0.292612 hartree
zpe.thermalcorrgfe: 0.239829 hartree
zpe.sumelectzpe: -650.726959 hartree
zpe.sumelectthermal: -650.713726 hartree
zpe.sumelectthermalent: -650.712782 hartree
zpe.sumelectthermalfe: -650.765566 hartree
dipole: 5.9211 -1.6852 -1.4444
dipole: 6.3235
quadrupole: -101.1458 -76.2256 -80.8943
quadrupole: 3.5440 -0.3107 1.6711
quadrupole: -15.0572 9.8630 5.1943 3.5440 -0.3107 1.6711
hfenergy: -651.0053945 hartree
pointgroup: C01 [X(C10H18N2O2)]
dipole: 2.3051067 0.7217723 0.5957284 debye
polarizability: 142.0379601|-0.1386805|125.6352945|2.9098888|-4.253735|99.375677 unknown
InChI: InChI=1S/C10H18N2O2/c11-10(14)12-6-2-4-7-3-1-5-8(13)9(7)12/h7-9,13H,1-6,11H2
charge 0 multiplicity 1
32 atoms
O  -0.088493 2.353487 0.727843
O  -3.483771 -0.283736 -0.347796
N  -1.159104 -0.260241 -0.004558
N  -2.247991 1.598548 -0.991628
C  1.114357 -0.947754 -0.795344
C  0.176729 0.241231 -0.399008
C  0.807211 1.170615 0.671842
C  2.545475 -0.449623 -1.121985
C  1.09944 -2.085388 0.25699
C  2.238885 1.612135 0.308385
C  3.153772 0.401777 0.015449
C  -0.345349 -2.577097 0.486233
C  -1.239203 -1.40357 0.928721
C  -2.365851 0.319458 -0.441296
H  0.678358 -1.375194 -1.722422
H  0.04086 0.863087 -1.305165
H  0.805328 0.664063 1.660521
H  2.519629 0.163448 -2.046387
H  3.190928 -1.323697 -1.337059
H  1.528483 -1.742204 1.220643
H  1.741831 -2.914698 -0.098085
H  2.657984 2.2331 1.126037
H  2.178875 2.25765 -0.590838
H  3.279924 -0.211126 0.929833
H  4.162867 0.754963 -0.268648
H  -0.746527 -3.009977 -0.450524
H  -0.373924 -3.368912 1.259339
H  -2.300501 -1.698264 0.96852
H  -0.933701 -1.079331 1.948861
H  0.167955 2.93808 1.482162
H  -3.117159 1.991518 -1.3473
H  -1.530019 2.227055 -0.613134
