program: Gaussian 09
title: 000026321
version: EM64L-G09RevD.01
frameworkgroup: C1[X(C11H16N2O2)]
method: RPBEPBE
basis: SDD
operation: Freq
keyword: #p
keyword: freq=noraman
keyword: PBEPBE/SDD
title: #p freq=noraman PBEPBE/SDD
converged: YES YES NO NO
title: Mulliken charges:
elementType: O O N N C C C C C C C C C C C H H H H H H H H H H H H H H H H
charge: -0.424862 -0.264604 -0.073865 -0.447530 -0.495854 0.447225 -0.642335 0.106052 0.506715 -0.378030 -0.352647 -0.623986 -0.615068 0.206576 -0.802351 0.232210 0.181316 0.229593 0.216135 0.309985 0.248978 0.174837 0.222651 0.221030 0.182609 0.233298 0.308162 0.355154 0.236305 0.268298 0.234005
chargesum: 0.00000
title: Mulliken charges with hydrogens summed into heavy atoms:
elementType: O O N N C C C C C C C C C C C
charge: -0.069708 -0.264604 -0.073865 -0.139368 -0.082328 0.447225 -0.412742 0.106052 0.506715 -0.161895 -0.042663 0.022479 0.021870 0.206576 -0.063745
polarizability: 2.10475558e+02 -9.43689016e+00 1.45833813e+02 7.04111940e+00 1.16423164e+01 8.79686603e+01
1716.lowfreq: -79.3108 -12.2723 -8.1418 -2.7708 -0.0009 -0.0008 -0.0007 37.6755 42.7081
frequency: -79.3103 37.5233 42.4908 51.9282 80.0208 93.1715 142.4497 165.8133 214.7213 225.1587 242.8931 264.5569 272.2351 309.2925 330.2282 341.1988 358.2268 376.5935 418.3322 449.0895 474.8163 495.6109 568.5499 587.4476 623.3955 633.1853 652.3224 724.6786 760.7367 785.3532 808.5982 821.8993 891.9457 901.6580 940.4958 962.9841 973.4605 1004.0139 1026.4244 1028.7117 1037.0217 1084.6312 1089.6170 1125.6854 1160.7649 1172.4267 1185.6697 1231.1580 1239.3357 1251.6273 1267.1431 1279.8134 1321.1602 1358.2762 1374.5628 1378.5766 1415.7105 1417.6551 1439.1851 1450.6237 1458.4269 1459.8212 1468.9229 1469.8855 1476.4151 1484.3393 1498.1368 1525.0870 1609.9137 1626.2153 1628.6775 2820.4061 2825.5858 2849.3408 2986.1426 3017.5431 3023.4776 3042.9440 3070.6443 3077.8778 3083.1898 3097.7159 3116.7421 3135.4371 3196.7449 3524.4514 3581.7900
redmass: 1.0551 3.6155 2.8664 4.7630 3.9978 4.1391 4.1504 4.6922 1.3585 1.2406 3.5742 2.3539 2.6372 3.7918 1.1424 3.4221 2.3960 4.9491 2.4227 2.9892 3.0592 4.4472 3.4048 3.2445 4.8494 1.5266 2.8920 4.1754 4.7662 4.5676 3.1623 1.6232 1.9203 3.1096 2.7126 1.3132 1.8464 1.9372 2.1608 1.6534 1.5635 2.1114 1.2610 1.3558 1.2731 1.5890 1.7498 2.5378 2.2223 2.4281 2.0967 1.7791 1.7379 1.4975 1.3431 3.1025 1.3300 2.6759 1.1763 1.1349 1.0856 1.0592 1.0471 1.0707 1.0597 1.0561 2.7698 2.1554 6.9790 6.6285 4.8103 1.0673 1.0610 1.0597 1.0384 1.0707 1.0697 1.0866 1.0984 1.1009 1.1005 1.0909 1.0906 1.0977 1.0945 1.0764 1.0660
irintensity: 0.0285 0.3501 0.5874 5.3759 3.6377 6.9173 10.4626 0.0786 1.3498 1.5632 0.6649 8.4784 1.9660 1.1671 119.2639 8.1606 3.6814 2.2347 1.9378 1.7405 6.0976 27.3335 16.9822 6.7792 7.2771 56.0230 8.0657 2.2267 10.4215 4.3206 12.9638 54.8743 28.0583 12.4713 21.5046 5.3480 7.2498 35.6990 37.7163 9.2426 15.2311 177.7523 2.4291 10.7756 27.1484 19.0393 27.7063 52.7562 48.4942 14.5704 50.4991 4.0966 64.5825 33.0344 35.0284 51.5468 1.7415 7.0403 3.2312 66.3026 2.7272 26.2275 20.0660 17.2906 23.9522 16.1386 420.1015 99.5372 19.5424 0.2363 162.2449 61.4471 83.0449 277.0253 10.9678 41.0046 44.5734 7.9123 16.8601 23.0417 46.4113 19.0434 16.9495 7.7370 6.5560 11.3175 39.0465
temp: 298.150 k
press: 1.00000 atm
elementType: 8 8 7 7 6 6 6 6 6 6 6 6 6 6 6 1 1 1 1 1 1 1 1 1 1 1 1 1 1 1 1
symmnumber: 1
zpe: 667030.1 jmol-1
zpe.correction: 0.254058 hartree
zpe.thermalcorrener: 0.269462 hartree
zpe.thermalcorrenthalpy: 0.270406 hartree
zpe.thermalcorrgfe: 0.210719 hartree
zpe.sumelectzpe: -687.572025 hartree
zpe.sumelectthermal: -687.556622 hartree
zpe.sumelectthermalent: -687.555678 hartree
zpe.sumelectthermalfe: -687.615365 hartree
dipole: -1.1002 -2.7021 -1.1474
dipole: 3.1350
quadrupole: -95.8075 -74.2979 -92.3449
quadrupole: -12.5255 -3.5256 3.0756
quadrupole: -8.3241 13.1856 -4.8615 -12.5255 -3.5256 3.0756
hfenergy: -687.8260838 hartree
pointgroup: C01 [X(C11H16N2O2)]
dipole: 0.4303176 -1.0535092 0.4756736 debye
polarizability: 210.653716|9.1882098|145.1049792|5.9692242|-13.1922821|88.5193356 unknown
InChI: InChI=1S/C11H16N2O2/c1-8(14)12-10-4-5-11(15)9(6-10)7-13(2)3/h4-6,12,15H,7H2,1-3H3
charge 0 multiplicity 1
31 atoms
O  2.293672 2.237897 -0.003128
O  -4.165808 0.628099 -0.461867
N  3.261802 -0.918596 -0.316568
N  -2.466464 -0.818037 0.269762
C  2.474136 -0.463481 0.857996
C  1.14812 0.165022 0.465133
C  -0.059008 -0.558873 0.541473
C  1.088071 1.510609 0.011684
C  -1.305273 0.005257 0.157855
C  -0.144889 2.083224 -0.374525
C  -1.343297 1.342625 -0.310977
C  2.664978 -2.073851 -1.006565
C  4.685591 -1.118663 0.008283
C  -3.792526 -0.502004 -0.026276
C  -4.770243 -1.65311 0.220444
H  3.084749 0.29043 1.385899
H  2.282789 -1.306309 1.574047
H  -0.020329 -1.59341 0.91129
H  -0.180812 3.12341 -0.724732
H  -2.296645 1.782292 -0.607331
H  1.63653 -1.831554 -1.324557
H  2.624361 -2.997999 -0.370144
H  3.253697 -2.309333 -1.911256
H  5.24207 -1.37517 -0.911263
H  4.866698 -1.935052 0.755231
H  5.107846 -0.181856 0.412885
H  -2.295896 -1.765274 0.615933
H  2.141744 3.151017 -0.351491
H  -4.539712 -2.522209 -0.423679
H  -5.785914 -1.303059 -0.012346
H  -4.743739 -1.989344 1.273788
