program: Gaussian 09
title: 000273601
version: EM64L-G09RevD.01
frameworkgroup: C1[X(C14H21N3)]
method: RPBEPBE
basis: SDD
operation: Freq
keyword: #pfreq=noraman
keyword: PBEPBE/SDD
title: #p freq=noraman PBEPBE/SDD
converged: YES YES NO NO
title: Mulliken charges:
elementType: N N N C C C C C C C C C C C C C C H H H H H H H H H H H H H H H H H H H H H
charge: -0.105559 -0.108641 -0.064351 -0.335722 -0.402221 -0.329503 -0.327857 -0.494574 -0.671378 -0.671046 0.489048 -0.353584 -0.435836 -0.124842 -0.227401 -0.215373 -0.238772 0.212242 0.206475 0.241518 0.232119 0.207834 0.191785 0.209867 0.196434 0.228783 0.242665 0.204991 0.228577 0.211523 0.208063 0.226325 0.210799 0.241681 0.230197 0.227146 0.228073 0.230514
chargesum: 0.00000
title: Mulliken charges with hydrogens summed into heavy atoms:
elementType: N N N C C C C C C C C C C C C C C
charge: -0.105559 -0.108641 -0.064351 0.082995 0.071416 0.070115 0.078445 -0.023126 -0.026286 -0.025859 0.489048 -0.111902 -0.205639 -0.124842 -0.000255 0.012700 -0.008257
polarizability: 2.02673199e+02 7.40011177e+00 1.49068019e+02 -5.63268087e-01 -1.88914160e+00 1.47989466e+02
1716.lowfreq: -9.3785 -6.0322 -4.2402 0.0001 0.0004 0.0007 14.9391 17.7302 20.2862
frequency: 14.5686 17.6822 20.1777 34.7682 55.8451 68.2934 72.1005 83.4570 134.4696 156.8587 177.5230 209.8362 237.6963 244.5996 269.2024 283.6101 312.4515 355.1146 376.1624 394.7916 403.7519 447.0322 466.0601 479.9925 495.9502 565.5494 616.0442 645.8485 701.8141 733.2760 745.6840 777.2568 789.2220 795.8354 798.7060 823.3877 853.4693 906.6690 914.5932 974.2362 977.7296 989.4213 990.7566 998.1230 1024.7737 1036.4516 1044.2293 1073.8021 1077.2348 1081.5616 1084.9283 1101.3379 1138.0280 1151.0749 1172.7558 1185.7689 1207.6500 1210.0786 1223.4968 1258.1120 1280.1754 1284.3460 1293.9538 1297.6169 1323.1832 1339.3081 1363.2070 1367.3956 1373.8894 1380.0599 1386.9819 1388.3790 1391.7322 1443.1862 1457.7632 1463.5325 1466.6049 1469.3315 1471.3139 1479.4331 1484.5027 1485.7217 1487.1872 1491.5568 1596.8479 1615.9080 2176.4859 2860.5547 2868.9609 2890.4865 2965.2870 2981.6227 2984.5016 3005.1236 3022.5945 3023.8947 3026.8919 3035.7212 3073.4251 3077.2055 3078.4679 3091.6920 3092.4285 3115.8855 3125.8836 3137.5916 3148.6593 3164.8669
redmass: 3.9418 3.7623 4.5309 4.4738 4.1588 3.3853 2.8767 2.0297 3.6067 2.2440 2.4700 1.3067 2.7667 1.6433 2.6781 1.9916 2.7880 2.7326 3.7363 3.1280 2.8059 2.7173 3.1751 4.3244 4.5842 5.3826 6.3545 5.0101 2.1332 1.9312 2.1448 1.2055 1.7989 1.2507 1.7388 3.4606 1.2496 1.3718 1.9261 1.9457 1.3956 2.4897 4.7278 1.3687 2.2709 3.3149 1.9473 2.5043 1.9258 1.6718 2.1447 1.8923 1.9088 2.0375 1.0564 1.1118 2.2929 2.4828 2.6063 1.4576 1.1747 1.3427 1.2779 1.2413 1.2941 1.4053 1.3344 1.3744 2.0107 1.3819 1.2388 1.2328 3.0614 2.1058 1.0744 1.0534 1.0615 1.1323 1.0846 1.0500 1.1492 1.7937 1.0728 1.0767 6.1351 6.0726 12.4399 1.0720 1.0712 1.0697 1.0618 1.0358 1.0358 1.0621 1.0879 1.0990 1.0904 1.0878 1.0986 1.0987 1.1033 1.1004 1.1004 1.0876 1.0858 1.0909 1.0959 1.1015
irintensity: 0.2674 0.5831 0.6972 2.9936 1.1593 1.0975 0.1210 0.2350 3.1829 0.2964 1.4617 0.3591 1.8454 0.4600 3.6485 1.4190 0.7879 2.1531 0.4990 8.0522 0.6077 5.9281 5.2259 0.6574 14.2897 8.4979 0.3278 9.9486 28.4696 58.5687 21.5729 5.4469 0.6002 6.0821 13.2076 1.4142 0.4507 1.6395 1.5114 26.3143 0.6205 3.3730 1.4941 1.7821 11.5882 2.6344 3.7851 30.3127 34.2799 14.5297 3.1117 45.6633 15.6426 41.2835 0.4021 1.8083 30.5633 9.1373 6.9174 38.6919 9.0628 7.8921 34.3454 1.2763 2.5750 13.7298 0.5399 5.8377 5.7861 8.6327 20.2531 22.4156 2.3942 11.8402 4.2020 7.2237 0.1655 24.2574 2.7667 2.8784 8.0519 17.1872 11.3468 10.7814 0.4067 3.2777 188.3608 42.6674 113.7567 116.4476 39.4946 28.0617 31.5286 32.8025 17.0683 16.5300 21.0470 17.7397 52.0643 51.5453 43.0481 28.0515 50.0470 8.2334 0.4597 11.4583 39.2026 21.7659
temp: 298.150 k
press: 1.00000 atm
elementType: 7 7 7 6 6 6 6 6 6 6 6 6 6 6 6 6 6 1 1 1 1 1 1 1 1 1 1 1 1 1 1 1 1 1 1 1 1 1
symmnumber: 1
zpe: 851216.3 jmol-1
zpe.correction: 0.324211 hartree
zpe.thermalcorrener: 0.342937 hartree
zpe.thermalcorrenthalpy: 0.343881 hartree
zpe.thermalcorrgfe: 0.272912 hartree
zpe.sumelectzpe: -708.989807 hartree
zpe.sumelectthermal: -708.971081 hartree
zpe.sumelectthermalent: -708.970137 hartree
zpe.sumelectthermalfe: -709.041106 hartree
dipole: 1.8482 -4.6296 -1.3425
dipole: 5.1625
quadrupole: -93.2307 -122.1359 -98.4609
quadrupole: 8.1747 5.7622 -6.8454
quadrupole: 11.3785 -17.5267 6.1483 8.1747 5.7622 -6.8454
hfenergy: -709.3140178 hartree
pointgroup: C01 [X(C14H21N3)]
dipole: 0.7233271 -1.7951739 -0.6160108 debye
polarizability: 202.7857202|6.98216|149.1501972|0.8940414|-1.6815296|147.794767 unknown
InChI: InChI=1S/C14H21N3/c1-3-16(4-2)10-11-17(13-15)12-14-8-6-5-7-9-14/h5-9H,3-4,10-12H2,1-2H3
charge 0 multiplicity 1
38 atoms
N  3.244835 -0.425931 0.123698
N  -0.115113 1.250828 -0.582928
N  -0.887855 3.304313 0.715366
C  1.787467 -0.197622 0.247553
C  1.339281 0.956082 -0.684045
C  3.641172 -1.85708 0.209558
C  4.045858 0.462517 1.011641
C  -1.083632 0.443663 -1.36861
C  3.282554 -2.655781 -1.057809
C  5.454982 0.753719 0.46173
C  -2.257794 -0.108372 -0.562985
C  -2.083887 -0.593434 0.756932
C  -3.540611 -0.180871 -1.15825
C  -0.532001 2.334405 0.097556
C  -3.172024 -1.149303 1.464052
C  -4.630008 -0.742698 -0.45479
C  -4.448211 -1.230359 0.859314
H  1.4787 0.039479 1.29442
H  1.249019 -1.119145 -0.042387
H  1.592078 0.69461 -1.728642
H  1.89621 1.876527 -0.436173
H  4.737191 -1.891807 0.345999
H  3.195204 -2.352114 1.109047
H  3.50256 1.420783 1.112612
H  4.121435 0.03768 2.044017
H  -0.499303 -0.3934 -1.79724
H  -1.469938 1.037542 -2.221983
H  2.192448 -2.671327 -1.241768
H  3.771571 -2.2077 -1.94018
H  3.617035 -3.705403 -0.960441
H  6.056917 -0.167311 0.358734
H  5.385603 1.226432 -0.533353
H  6.000496 1.434613 1.14137
H  -1.101215 -0.514827 1.235925
H  -3.691321 0.209713 -2.172711
H  -3.027621 -1.513012 2.487613
H  -5.618175 -0.789175 -0.925921
H  -5.293107 -1.658134 1.410279
