program: Gaussian 09
title: 000273582
version: EM64L-G09RevD.01
frameworkgroup: C1[X(C12H12N2O)]
method: RPBEPBE
basis: SDD
operation: Freq
keyword: #p
keyword: freq=noraman
keyword: PBEPBE/SDD
title: #p freq=noraman PBEPBE/SDD
converged: YES YES NO YES
title: Mulliken charges:
elementType: O N N C C C C C C C C C C C C H H H H H H H H H H H H
charge: -0.190189 0.023966 -0.431780 0.256469 0.430172 -0.058382 -0.572494 0.187889 -0.377784 -0.815116 -0.308273 -0.260622 -0.226844 0.201058 -0.807058 0.218798 0.237629 0.239103 0.229738 0.239106 0.273575 0.227132 0.231438 0.314639 0.234123 0.269593 0.234114
chargesum: 0.00000
title: Mulliken charges with hydrogens summed into heavy atoms:
elementType: O N N C C C C C C C C C C C C
charge: -0.190189 0.023966 -0.117140 0.256469 0.430172 -0.058382 -0.353696 0.187889 -0.140155 -0.107168 -0.034698 -0.033490 0.004593 0.201058 -0.069229
polarizability: 2.35377739e+02 1.52045434e+01 1.67704572e+02 9.95230643e-03 5.30435330e-03 6.74310849e+01
1716.lowfreq: -64.1845 -8.1730 -0.0006 0.0005 0.0007 5.1196 8.6044 16.9067 59.5900
frequency: -64.1315 16.8718 59.5458 104.3322 122.2012 151.8855 168.0616 218.2026 261.5214 271.3080 300.6444 315.2239 421.4987 469.1352 482.0439 515.6394 531.0079 535.4810 566.9081 586.7189 594.4634 631.0976 691.0811 702.4432 759.9590 771.7661 789.7565 847.6052 863.7833 880.9142 912.9438 940.4998 964.0348 989.4697 996.2327 1017.7330 1027.6527 1031.5733 1044.8272 1067.6153 1129.3557 1171.2276 1195.1037 1213.1662 1256.3924 1289.4779 1298.2622 1369.9696 1372.2962 1395.4454 1404.3469 1416.6124 1444.6164 1458.2568 1466.7954 1467.9051 1479.4897 1485.5595 1517.1397 1563.8687 1608.8523 1620.7658 1664.7730 2979.9809 2983.7418 3058.0506 3069.5632 3092.4012 3114.1800 3128.4723 3136.0713 3140.9025 3158.0337 3173.2274 3530.8326
redmass: 1.0449 6.7898 3.6889 5.2842 3.3141 1.3017 2.7781 2.9633 3.0762 6.7131 3.5791 4.9958 3.0867 4.8135 4.7896 5.5386 3.1941 5.1364 3.1601 2.9519 5.4195 1.2136 3.4336 4.9227 5.4315 1.3353 3.1065 6.5306 1.5456 1.5829 3.8857 2.7976 1.3631 2.1191 1.3249 2.3145 1.6857 2.7253 1.5730 2.2890 1.6431 1.1284 2.1464 1.7227 1.6660 4.0227 3.5792 1.2299 2.6937 1.6924 2.1814 3.3255 1.2204 2.1608 1.0456 1.0476 1.4822 1.7132 3.3976 4.8896 5.4941 6.5560 6.1181 1.0376 1.0382 1.0972 1.0985 1.0987 1.0917 1.0850 1.0978 1.0900 1.0962 1.0987 1.0763
irintensity: 0.1548 4.7961 3.7496 3.7554 0.2626 0.2339 5.8804 0.3091 0.8980 1.1378 0.9758 0.5313 4.8246 5.9261 4.5829 1.1101 2.1489 7.9132 4.9297 0.3923 3.4458 74.0329 3.2519 2.9396 0.6134 82.6023 2.1409 0.4041 44.5363 0.0756 0.7715 26.7629 2.6131 10.1280 0.5986 16.6576 8.1186 6.2961 7.6987 0.3937 4.2692 1.8220 41.8602 207.0486 26.9890 1.0090 25.1361 69.6054 55.7878 6.5091 46.0135 81.8121 190.9743 32.6925 16.0823 18.9028 321.7829 101.2643 176.4562 58.3856 96.1549 12.6322 120.3525 22.5071 10.1263 14.8533 17.6178 17.8467 23.3732 0.0373 8.6081 15.4322 29.5180 16.6417 14.7472
temp: 298.150 k
press: 1.00000 atm
elementType: 8 7 7 6 6 6 6 6 6 6 6 6 6 6 6 1 1 1 1 1 1 1 1 1 1 1 1
symmnumber: 1
zpe: 559127.5 jmol-1
zpe.correction: 0.212960 hartree
zpe.thermalcorrener: 0.225757 hartree
zpe.thermalcorrenthalpy: 0.226701 hartree
zpe.thermalcorrgfe: 0.172437 hartree
zpe.sumelectzpe: -648.166120 hartree
zpe.sumelectthermal: -648.153324 hartree
zpe.sumelectthermalent: -648.152380 hartree
zpe.sumelectthermalfe: -648.206644 hartree
dipole: -0.8925 5.7210 0.0039
dipole: 5.7901
quadrupole: -70.4510 -82.1844 -91.5349
quadrupole: 13.1690 0.0177 -0.0073
quadrupole: 10.9391 -0.7943 -10.1448 13.1690 0.0177 -0.0073
hfenergy: -648.3790809 hartree
pointgroup: C01 [X(C12H12N2O1)]
dipole: 0.3097993 2.2568554 -0.0006493 debye
polarizability: 235.9123331|-13.9539795|167.1699507|-0.046253|0.0417682|67.4311114 unknown
InChI: InChI=1S/C12H12N2O/c1-8-7-12(13-9(2)15)14-11-6-4-3-5-10(8)11/h3-7,13H,1-2H3
charge 0 multiplicity 1
27 atoms
O  -3.283918 -1.718491 0.002703
N  -0.523689 -0.73287 -0.000587
N  -2.550908 0.535593 0.000404
C  1.665624 0.471705 -0.000021
C  0.967967 1.740782 0.000877
C  0.86535 -0.736476 -0.000688
C  -0.425395 1.717233 0.001062
C  -1.134577 0.458631 0.000297
C  3.091486 0.355761 -0.000269
C  1.725569 3.052432 0.001648
C  1.51819 -2.009428 -0.00157
C  3.706359 -0.90117 -0.001134
C  2.913843 -2.090865 -0.001788
C  -3.526987 -0.488283 0.001201
C  -4.953751 0.080054 0.001237
H  -0.986413 2.660274 0.001845
H  3.708555 1.260772 0.000229
H  2.377038 3.140373 -0.887932
H  1.034405 3.911588 0.002336
H  2.377314 3.139164 0.891146
H  0.881443 -2.899095 -0.002041
H  4.799287 -0.977186 -0.00131
H  3.405959 -3.069704 -0.002459
H  -2.923328 1.488107 0.000036
H  -5.13927 0.702018 0.897044
H  -5.662516 -0.760085 0.002112
H  -5.139837 0.70067 -0.89538
