program: Gaussian 09
title: 000273581
version: EM64L-G09RevD.01
frameworkgroup: C1[X(C23H20N2)]
method: RPBEPBE
basis: SDD
operation: Freq
keyword: #pfreq=noraman
keyword: PBEPBE/SDD
title: #p freq=noraman PBEPBE/SDD
converged: YES YES NO NO
title: Mulliken charges:
elementType: N N C C C C C C C C C C C C C C C C C C C C C C C H H H H H H H H H H H H H H H H H H H H
charge: -0.442023 -0.098324 -0.330386 0.479475 0.367000 0.216297 0.434887 0.237937 -0.560390 -0.046011 -0.396695 -0.376229 -0.415744 -0.419770 -0.379064 -0.819946 -0.335920 -0.239228 -0.241784 -0.236024 -0.228931 -0.246282 -0.248778 -0.271347 -0.227100 0.280386 0.297845 0.223401 0.252164 0.252692 0.257883 0.258037 0.235820 0.237293 0.230194 0.236383 0.255297 0.224874 0.225452 0.225931 0.223672 0.228015 0.227702 0.224686 0.226656
chargesum: 0.00000
title: Mulliken charges with hydrogens summed into heavy atoms:
elementType: N N C C C C C C C C C C C C C C C C C C C C C C C
charge: -0.144178 -0.098324 -0.050000 0.479475 0.367000 0.216297 0.434887 0.237937 -0.336989 -0.046011 -0.144531 -0.123538 -0.157861 -0.161733 -0.143245 -0.116076 -0.080623 -0.014355 -0.016332 -0.010093 -0.005259 -0.018267 -0.021076 -0.046661 -0.000444
polarizability: 3.63935421e+02 4.08325533e+00 2.31841096e+02 -2.62025506e+01 -1.95273494e+01 2.21192953e+02
1716.lowfreq: -8.4160 -4.2028 -0.0006 -0.0006 -0.0005 5.1434 13.1692 26.3329 28.8663
frequency: 12.5701 26.2558 28.8216 45.2680 57.1476 75.2169 90.0216 134.8514 146.3549 160.4827 192.7708 215.9303 220.1181 241.0781 270.7343 284.6192 301.5245 335.4579 389.9472 402.9446 406.8744 420.3466 457.0807 466.0468 487.5944 505.6204 518.3317 530.4132 551.9441 579.7510 583.4953 607.5703 616.7736 617.8677 637.6210 683.7533 684.9118 706.2365 708.2189 745.5625 747.8865 766.3107 776.9518 782.1317 833.3216 857.7684 859.3149 861.1591 862.7593 872.6889 873.1577 929.3255 935.4864 953.7101 976.1568 981.1143 985.4070 987.4847 990.3086 991.5705 994.8265 997.4894 1000.4417 1023.7799 1026.7895 1028.8649 1044.5959 1065.4948 1067.9203 1082.4658 1093.3186 1135.2729 1169.9762 1170.8435 1172.2064 1183.3828 1189.9556 1190.8823 1214.6852 1218.1336 1251.8578 1262.7004 1272.7708 1304.8204 1316.4202 1330.5115 1345.5186 1375.8796 1380.7722 1384.7067 1395.8926 1407.6902 1419.2456 1434.7484 1444.6478 1459.4085 1467.1908 1476.2039 1480.5009 1482.3447 1493.9510 1517.3744 1554.3186 1588.8374 1593.5287 1610.5287 1613.0547 1616.1164 1620.3487 2977.9636 2999.2502 3055.4634 3090.9589 3116.5932 3121.3579 3121.9202 3124.2537 3125.7172 3128.6706 3135.0299 3136.3376 3141.8760 3145.2617 3149.2638 3154.3487 3161.8806 3163.4775 3167.0937 3551.2735
redmass: 5.4607 4.0179 4.1435 4.2005 4.8609 4.5386 4.5525 4.9896 3.8296 1.2261 2.9956 4.2095 3.7707 4.6351 3.2112 5.3824 5.0428 3.6037 4.2803 2.8400 2.8701 3.0693 5.0644 3.1485 1.5164 4.0429 5.2773 2.9714 5.2691 3.6163 3.6522 5.2232 6.3010 6.2253 5.6165 3.6005 5.3549 1.9578 1.8207 1.8241 3.4407 1.3288 2.1975 3.2292 3.6305 1.3124 1.4901 3.7162 1.2853 2.7294 1.9616 1.4852 1.5155 1.3658 2.4755 1.4645 1.5096 1.3197 4.6292 4.2944 1.8548 1.3623 1.9827 2.4550 2.3544 2.1379 1.5714 2.8101 1.9671 1.6185 2.0550 1.5648 1.1254 1.0548 1.0633 1.8187 1.1357 1.4574 1.4678 2.3566 1.6643 1.6172 1.5757 3.1905 1.4643 1.8231 1.3626 2.8002 5.4239 5.2479 1.3343 3.5653 3.3270 2.2395 2.1259 2.0743 1.0489 1.3332 2.1984 2.2175 2.6550 3.0933 5.6120 6.0481 6.2108 6.0076 6.2350 6.1502 6.7820 1.0376 1.0816 1.0972 1.0986 1.0857 1.0843 1.0917 1.0869 1.0847 1.0875 1.0919 1.0894 1.0920 1.0962 1.0957 1.0950 1.1015 1.1014 1.0998 1.0769
irintensity: 0.1645 0.5242 0.7653 0.5403 0.8320 0.2419 1.1888 0.2339 4.1632 0.0890 2.6636 0.1918 2.1427 0.9074 1.2084 0.5110 0.2719 2.2670 11.3246 0.2304 0.5181 2.3624 0.0422 20.9044 110.3000 20.8871 6.2082 0.7899 9.6691 14.0166 12.3632 44.1587 1.6313 5.5067 1.7320 1.0325 6.0046 62.1197 33.2220 46.8976 21.1148 86.2721 21.5689 0.5723 8.6179 1.6008 38.1376 6.0822 2.5807 1.4419 0.2530 3.2924 0.8369 2.4574 0.1064 0.4184 0.2198 0.3158 0.4047 0.4252 1.1597 0.0965 1.1520 22.8854 2.9293 13.8845 6.5171 8.4265 15.2434 9.6297 19.0830 4.1200 0.9811 1.6563 0.1894 18.6424 2.3848 2.7706 68.5777 11.4570 9.1052 3.1087 5.9220 0.6641 3.4731 22.9488 7.5936 46.7988 4.4638 1.3575 6.8687 74.4464 68.3546 9.1485 10.7708 0.5705 13.8832 15.2336 14.9971 39.7198 304.9370 200.1692 51.0288 1.0867 0.3351 17.9085 134.8991 143.5138 119.6437 27.1178 43.5249 15.3242 18.9603 5.8161 2.0442 16.8880 0.1634 0.5392 2.0438 15.6593 13.5054 20.2390 32.7620 38.3152 34.1394 32.2152 25.8610 27.1823 43.9365
temp: 298.150 k
press: 1.00000 atm
elementType: 7 7 6 6 6 6 6 6 6 6 6 6 6 6 6 6 6 6 6 6 6 6 6 6 6 1 1 1 1 1 1 1 1 1 1 1 1 1 1 1 1 1 1 1 1
symmnumber: 1
zpe: 955298.0 jmol-1
zpe.correction: 0.363854 hartree
zpe.thermalcorrener: 0.384497 hartree
zpe.thermalcorrenthalpy: 0.385442 hartree
zpe.thermalcorrgfe: 0.311937 hartree
zpe.sumelectzpe: -996.255374 hartree
zpe.sumelectthermal: -996.234730 hartree
zpe.sumelectthermalent: -996.233786 hartree
zpe.sumelectthermalfe: -996.307291 hartree
dipole: 0.1785 0.0664 2.4897
dipole: 2.4969
quadrupole: -129.8953 -141.3217 -136.0992
quadrupole: -0.7725 2.1431 -5.1931
quadrupole: 5.8767 -5.5496 -0.3271 -0.7725 2.1431 -5.1931
hfenergy: -996.6192278 hartree
pointgroup: C01 [X(C23H20N2)]
dipole: -0.0340509 -0.4956894 -0.8474587 debye
polarizability: 346.5467499|-41.1343905|225.5924822|28.0351635|-26.554235|244.8302374 unknown
InChI: InChI=1S/C23H20N2/c1-17-16-22(24-21-15-9-8-14-20(17)21)25-23(18-10-4-2-5-11-18)19-12-6-3-7-13-19/h2-16,23,25H,1H3
charge 0 multiplicity 1
45 atoms
N  -0.337393 0.0696 -1.024973
N  1.402965 -0.111742 0.551521
C  -1.268523 0.657096 -0.037062
C  -2.255292 -0.41976 0.446681
C  -1.917458 1.945324 -0.567516
C  0.94068 -0.365728 -0.691636
C  3.021275 -1.472208 -1.405912
C  3.55336 -1.200905 -0.083149
C  1.727076 -1.051659 -1.693255
C  2.694616 -0.511791 0.859486
C  -3.429791 -0.74027 -0.282018
C  -3.095767 2.461736 0.032872
C  -1.940488 -1.176068 1.603419
C  -1.301091 2.694862 -1.600418
C  4.868984 -1.579987 0.326864
C  3.852334 -2.19342 -2.44738
C  3.190333 -0.231234 2.171956
C  -4.270006 -1.795288 0.136915
C  -3.647016 3.688443 -0.397185
C  -2.782062 -2.228797 2.027405
C  -1.85389 3.920489 -2.035868
C  -3.949888 -2.543028 1.294522
C  -3.031451 4.422678 -1.437662
C  5.33159 -1.293657 1.617346
C  4.483811 -0.613831 2.543861
H  -0.618496 0.927184 0.818202
H  -0.733509 -0.246656 -1.911604
H  1.294067 -1.237606 -2.68345
H  -3.695153 -0.154411 -1.170781
H  -3.581394 1.902205 0.840181
H  -1.023585 -0.943636 2.157884
H  -0.376797 2.317608 -2.050947
H  5.525016 -2.101251 -0.378953
H  4.146433 -3.201332 -2.098964
H  3.293884 -2.31041 -3.390909
H  4.785251 -1.642103 -2.670035
H  2.524432 0.29277 2.864692
H  -5.175058 -2.03191 -0.434333
H  -4.556425 4.071393 0.079863
H  -2.527114 -2.802865 2.925398
H  -1.361841 4.485069 -2.836263
H  -4.604018 -3.359187 1.621599
H  -3.461054 5.373466 -1.772663
H  6.342433 -1.589332 1.918476
H  4.851019 -0.390645 3.552088
