program: Gaussian 09
title: 000273578
version: EM64L-G09RevD.01
frameworkgroup: C1[X(C9H12O3)]
method: RPBEPBE
basis: SDD
operation: Freq
keyword: #pfreq=noraman
keyword: PBEPBE/SDD
title: #p freq=noraman PBEPBE/SDD
converged: YES YES NO NO
title: Mulliken charges:
elementType: O O O C C C C C C C C C H H H H H H H H H H H H
charge: -0.248320 -0.421705 -0.224114 -0.219692 -0.247088 -0.202131 -0.105605 -0.145570 -0.510223 -0.482459 -0.349536 0.108621 0.259333 0.269825 0.268624 0.247291 0.262278 0.221753 0.261569 0.235179 0.220217 0.203206 0.221079 0.377469
chargesum: 0.00000
title: Mulliken charges with hydrogens summed into heavy atoms:
elementType: O O O C C C C C C C C C
charge: -0.248320 -0.044236 -0.224114 0.039641 0.022737 0.066493 0.141686 0.116708 -0.026901 -0.027064 0.074749 0.108621
polarizability: 1.04101858e+02 1.82834583e+00 1.00275031e+02 1.42010403e+00 -3.03274137e-01 7.88940005e+01
1716.lowfreq: -9.9936 -0.0011 -0.0009 -0.0008 14.0175 23.0276 30.5021 87.2417 151.2189
frequency: 29.6015 86.9667 151.2112 169.5406 301.8922 321.1815 363.9424 388.7933 449.6901 546.2030 547.4265 579.6697 620.2196 680.3775 698.2281 762.4701 770.9693 805.8351 843.6863 877.4572 888.4336 898.7953 928.8424 943.2664 956.2650 963.1284 978.6092 985.2802 1011.8007 1037.4695 1048.3673 1062.7273 1078.8137 1106.9221 1121.0514 1148.6889 1161.0334 1183.9759 1207.7945 1233.0538 1243.8798 1254.1355 1264.3055 1272.6583 1279.1345 1296.4298 1305.1580 1306.7633 1340.5828 1353.6964 1454.1207 1488.7189 1490.5648 1656.9442 2979.0459 3007.2310 3022.1765 3025.0583 3052.0160 3059.9822 3064.9532 3081.1974 3085.6340 3092.7837 3095.4797 3507.9844
redmass: 9.3134 4.7962 4.4623 4.0444 4.8763 2.4351 4.4147 2.4092 2.0290 4.7201 3.7643 1.8124 2.6778 3.0825 4.7694 4.6315 3.0020 4.3967 2.5555 3.1282 3.1990 3.9158 2.1094 2.2335 2.2573 2.5680 2.1031 1.6163 2.0625 1.7885 1.8494 1.7850 1.4986 1.1631 1.3456 1.7661 1.3576 1.5466 1.9032 1.4018 1.6277 1.4718 1.5037 1.4618 1.4003 1.4789 1.5203 1.5705 1.3474 1.8486 1.0874 1.0857 1.0993 8.5646 1.0627 1.0620 1.0638 1.0820 1.1020 1.0880 1.0894 1.1014 1.0890 1.1037 1.0953 1.0639
irintensity: 1.2274 5.5172 1.4715 1.1868 6.1763 0.5677 7.4300 1.3513 3.6651 14.3381 19.3552 64.1648 36.2293 53.2295 2.2114 4.2790 11.3583 3.4864 4.1301 3.2453 4.2603 6.0987 3.7475 14.6598 24.7642 5.5950 76.9026 13.4410 72.7864 22.5568 72.2161 76.8951 2.8101 0.5743 19.9802 14.4771 1.8843 9.8796 2.9999 6.8795 3.6075 0.6024 1.8344 3.5342 1.5021 3.8773 13.3363 19.8840 0.6505 32.8793 11.7552 1.5904 14.4208 213.5540 77.2218 29.5947 37.9183 1.0976 34.0299 17.1472 25.9736 16.9911 65.2801 35.5900 7.3956 21.4445
temp: 298.150 k
press: 1.00000 atm
elementType: 8 8 8 6 6 6 6 6 6 6 6 6 1 1 1 1 1 1 1 1 1 1 1 1
symmnumber: 1
zpe: 520497.1 jmol-1
zpe.correction: 0.198247 hartree
zpe.thermalcorrener: 0.207825 hartree
zpe.thermalcorrenthalpy: 0.208769 hartree
zpe.thermalcorrgfe: 0.162467 hartree
zpe.sumelectzpe: -574.905955 hartree
zpe.sumelectthermal: -574.896378 hartree
zpe.sumelectthermalent: -574.895433 hartree
zpe.sumelectthermalfe: -574.941735 hartree
dipole: 0.5876 0.1929 0.9073
dipole: 1.0981
quadrupole: -74.3707 -71.7115 -68.6592
quadrupole: 11.0908 -3.0239 3.0208
quadrupole: -2.7902 -0.1311 2.9213 11.0908 -3.0239 3.0208
hfenergy: -575.1042022 hartree
pointgroup: C01 [X(C9H12O3)]
dipole: 0.2252067 -0.101488 -0.3544267 debye
dipolederiv: -0.4998116 0.0648951 0.0526304 0.0042728 -0.8054723 -0.0902632 0.0603941 0.0015028 -0.3764094 -0.5437682 0.4284617 -0.1237016 0.4319349 -1.0320348 0.1074816 -0.087542 0.0564283 -0.3947226 -0.8059762 -0.2680438 0.090434 -0.0188712 -0.7963049 0.093677 0.1213206 0.1791528 -0.3206795 -0.0462042 -0.0346328 0.0895294 -0.0234746 -0.0477592 0.025796 0.0427544 0.0271166 0.0575435 0.0600909 0.0206012 0.0150919 0.0606725 -0.0077182 0.0850874 0.182024 0.0704293 0.0960005 0.0804462 0.0021107 0.0116517 -0.0296912 0.0935137 0.0339111 0.0298502 0.0150434 0.055742 0.3376796 0.0768104 0.0912622 -0.0169569 0.61775 0.0682867 0.0566166 -0.0467197 0.2170101 -0.3518889 -0.0143679 -0.0032622 -0.1340965 -0.0420721 -0.026157 -0.0244525 -0.0420222 0.0450414 0.073856 -0.0611925 -0.0318002 -0.0504076 0.067881 -0.0159458 -0.01763 0.0229813 -0.0389674 -0.0385102 -0.0792682 -0.0711481 -0.0388009 0.0157829 -0.042631 -0.0655863 -0.0903147 -0.03572 0.2978249 -0.2056671 -0.0297267 -0.0784821 0.4557945 0.066661 -0.0532494 0.1697548 0.3193301 1.3838906 -0.1187008 -0.0642275 -0.252842 1.3959251 -0.267889 -0.1935249 -0.2825014 0.1957014 0.0054298 -0.0142834 -0.0871626 -0.0047274 0.0507941 -0.0563395 -0.0867853 -0.0373865 -0.113116 -0.019987 0.0439982 0.0856389 0.0326164 0.0373985 -0.0611707 0.0728899 -0.0789126 -0.0224497 -0.0066785 -0.0870114 -0.0732664 -0.0655097 -0.0143692 -0.0745079 -0.0707073 -0.0595599 0.0205082 -0.1415374 0.0686203 -0.0511936 0.0580936 -0.0246559 0.0080966 -0.0633531 0.0103612 0.0543903 0.0561631 -0.0036413 0.0220018 0.0382539 0.014138 0.0901994 -0.0067083 0.0705836 -0.038011 0.0046647 0.1319945 -0.0432066 0.0833091 -0.1254961 0.0538711 -0.0217347 0.0108512 0.0743528 -0.0387089 -0.0444597 0.1244711 0.0040509 0.0721598 -0.0144343 0.1048837 -0.0068925 -0.0013159 0.0625825 -0.004779 0.0084867 -0.0239316 0.0518803 0.1078324 0.0237995 0.0503667 -0.0989196 -0.0029805 0.0787716 0.0163658 0.1047537 -0.1538813 -0.0602828 -0.0053956 -0.0050687 0.0759247 -0.0184534 -0.0412873 -0.0473791 -0.040896 -0.0880201 -0.1061452 -0.0380098 -0.1915611 -0.0717452 0.0283507 0.0993096 -0.051068 0.0660368 -0.0366211 0.0452035 -0.0472148 0.133209 -0.0501198 0.1235259 -0.0382383 0.0695788 -0.1053068 0.3013874 0.0296626 0.087361 0.023158 0.3506311 unknown
polarizability: 103.9165513|-2.0563862|100.3770707|-1.5184281|-1.1750832|78.9772684 unknown
InChI: InChI=1S/C9H12O3/c10-9(11)8-4-1-5-6(8)3-12-7(5)2-4/h4-8,10H,1-3H2
charge 0 multiplicity 1
24 atoms
O  -2.310104 -1.051962 0.463925
O  2.681547 -1.461896 0.307783
O  2.87974 0.783419 -0.23761
C  -1.091095 0.307874 -1.172152
C  -0.187158 -0.862513 -0.653466
C  0.08828 1.30234 0.512518
C  -2.106898 0.353664 0.013628
C  0.679016 -0.138916 0.470348
C  -0.218919 1.572461 -0.9887
C  -1.352165 1.205926 1.091584
C  -1.195312 -1.87102 -0.081784
C  2.157999 -0.165695 0.141343
H  -1.537022 0.130747 -2.162587
H  0.443432 -1.311198 -1.438251
H  0.742136 2.032471 1.012283
H  -3.10611 0.742757 -0.237747
H  0.54849 -0.666565 1.433178
H  -0.778168 2.512145 -1.143631
H  0.682664 1.583752 -1.623232
H  -1.41664 0.716058 2.078336
H  -1.791999 2.217025 1.174704
H  -1.591128 -2.534425 -0.876646
H  -0.785465 -2.491216 0.735223
H  3.650476 -1.454234 0.076954
