program: Gaussian 09
title: 000273527
version: EM64L-G09RevD.01
frameworkgroup: C1[X(C18H18O5)]
method: RPBEPBE
basis: SDD
operation: Freq
keyword: #pfreq=noraman
keyword: PBEPBE/SDD
title: #p freq=noraman PBEPBE/SDD
converged: YES YES NO NO
title: Mulliken charges:
elementType: O O O O O C C C C C C C C C C C C C C C C C C H H H H H H H H H H H H H H H H H H
charge: -0.198332 -0.202794 -0.258853 -0.207670 -0.270211 -0.181783 -0.276491 -0.101716 -0.081498 -0.575603 0.351708 -0.403299 0.204059 -0.545046 0.350362 -0.456064 0.478121 -0.537310 -0.374706 -0.407307 -0.225294 -0.225107 -0.228569 0.289816 0.252973 0.255845 0.240056 0.260563 0.263837 0.253379 0.266089 0.215267 0.218410 0.215762 0.218407 0.252269 0.236673 0.234790 0.232118 0.232408 0.234740
chargesum: 0.00000
title: Mulliken charges with hydrogens summed into heavy atoms:
elementType: O O O O O C C C C C C C C C C C C C C C C C C
charge: -0.198332 -0.202794 -0.258853 -0.207670 -0.270211 0.108034 -0.023518 0.154129 0.158557 -0.051202 0.351708 -0.149920 0.204059 -0.278958 0.350362 -0.022387 0.478121 0.149128 -0.138033 -0.172517 0.006823 0.007302 0.006171
polarizability: 2.40622390e+02 2.30652070e+01 2.25895081e+02 -3.22039278e+00 6.21675283e+00 1.59624296e+02
1716.lowfreq: -17.2003 -8.2647 -3.2450 -0.0008 -0.0007 -0.0006 5.0516 21.5627 27.5319
frequency: -16.4463 21.4211 27.4702 31.0277 40.7758 58.6770 94.5963 100.0557 118.3026 144.7694 163.5203 182.2449 225.6172 235.3462 264.4589 266.4456 329.5632 345.4426 381.1314 401.2088 406.9226 423.1480 480.4512 495.6166 503.6774 506.1959 517.3586 559.5573 593.9635 599.1968 614.4426 617.2024 648.3223 655.7929 695.7815 704.9769 726.2426 760.7471 765.6868 796.3245 808.5493 822.7704 830.9174 844.7510 853.1871 862.7215 876.8206 905.3508 921.1261 931.9240 946.4036 977.4502 978.5260 990.9096 991.1790 1000.4158 1004.4989 1019.6080 1026.7422 1042.7025 1070.7945 1090.7851 1102.8816 1107.2376 1123.9491 1134.5379 1153.3954 1171.1253 1172.7589 1174.7741 1188.5473 1193.5364 1224.8419 1228.6631 1241.5717 1256.8055 1269.0885 1279.4046 1291.7500 1303.7696 1313.2016 1326.7607 1339.5162 1349.9591 1360.1306 1387.5801 1396.9209 1438.8438 1441.8978 1444.3902 1467.6642 1472.6117 1481.8203 1487.5353 1597.2625 1598.9488 1617.3909 1658.8049 1697.4911 2956.7564 2967.9747 2993.9795 3017.6414 3020.1123 3030.0217 3045.7099 3084.3671 3092.6227 3103.1000 3119.9745 3123.1643 3125.6485 3138.6110 3151.4040 3167.7353 3171.1523 3183.6065
redmass: 3.7442 4.9037 5.3111 3.2387 4.7310 7.3000 4.8483 4.7664 4.8698 7.5412 3.3642 2.8552 1.9017 3.0880 3.0572 4.3991 6.1908 2.3056 5.7239 2.8199 5.4373 3.9260 5.1214 3.3099 3.6811 4.7697 6.3934 4.5116 4.5823 4.7182 4.1694 6.2676 5.5309 4.7805 4.2151 1.9395 4.4595 1.9986 7.1907 1.6296 1.8085 6.2529 3.9742 3.7696 1.2479 3.2464 4.0979 2.9932 4.1077 1.7199 5.1081 1.3942 1.6071 3.5986 6.1643 1.3315 2.9111 2.9806 2.1815 3.1962 2.3526 1.5079 1.2842 3.2594 2.0099 1.6492 1.6495 1.1378 1.5211 1.0543 1.1152 1.0930 2.5553 2.4111 1.9678 1.2447 1.4562 1.3489 1.4681 1.2130 1.5418 1.2752 1.5514 1.5599 1.7625 8.2175 2.2077 1.1906 2.1826 1.0811 1.0518 1.0526 1.1110 2.4049 6.2115 8.3537 6.1825 7.2025 12.6198 1.0332 1.0562 1.0829 1.0653 1.0865 1.1072 1.1042 1.0879 1.0969 1.0901 1.0987 1.0873 1.0875 1.0915 1.0962 1.1016 1.0898 1.0920
irintensity: 0.1249 4.1481 0.6514 2.9472 1.1012 5.7750 1.5018 1.5528 2.7767 2.6875 0.5095 1.2730 0.4986 2.4049 0.6556 2.3811 6.1411 2.1704 7.8075 0.0224 3.8174 16.2787 16.1291 4.0351 1.0062 1.0922 3.9766 2.8833 10.6661 21.9367 13.8681 0.7289 61.4350 10.2059 63.5645 13.3391 77.7683 96.0956 15.0193 5.8708 64.5689 149.0985 27.6542 31.8367 0.0355 25.2996 38.3015 64.8062 46.6268 21.0308 110.5353 0.1567 2.9129 62.6336 2.3174 0.4104 29.7079 110.9823 3.5056 75.2129 25.3275 6.9401 1.2953 61.9949 110.9924 89.5377 56.4608 0.9765 41.0498 0.0103 1.2201 2.7136 160.0471 14.6981 49.5451 9.0464 5.6906 0.9602 4.2567 1.0767 27.1987 0.9352 2.1379 40.7583 57.2122 1.3906 54.0862 3.0871 9.7099 17.8217 27.3175 27.9741 5.9001 5.0800 11.6906 196.1792 0.4101 240.4990 363.2894 67.0405 34.2292 6.1266 8.4027 28.3434 20.1687 49.5287 1.8596 2.2208 24.6490 28.1149 6.1318 3.3894 10.9326 33.3915 21.0166 15.6771 4.0611
temp: 298.150 k
press: 1.00000 atm
elementType: 8 8 8 8 8 6 6 6 6 6 6 6 6 6 6 6 6 6 6 6 6 6 6 1 1 1 1 1 1 1 1 1 1 1 1 1 1 1 1 1 1
symmnumber: 1
zpe: 845118.4 jmol-1
zpe.correction: 0.321889 hartree
zpe.thermalcorrener: 0.341283 hartree
zpe.thermalcorrenthalpy: 0.342227 hartree
zpe.thermalcorrgfe: 0.271394 hartree
zpe.sumelectzpe: -1071.104908 hartree
zpe.sumelectthermal: -1071.085514 hartree
zpe.sumelectthermalent: -1071.084570 hartree
zpe.sumelectthermalfe: -1071.155402 hartree
dipole: -9.1097 4.5185 0.0431
dipole: 10.1688
quadrupole: -151.4683 -138.5590 -128.6181
quadrupole: 16.3352 -2.1812 -6.7155
quadrupole: -11.9198 0.9894 10.9304 16.3352 -2.1812 -6.7155
hfenergy: -1071.4267965 hartree
pointgroup: C01 [X(C18H18O5)]
dipole: -3.5707181 1.7458419 -0.4558599 debye
polarizability: 241.0213099|22.3798111|226.0497082|-3.7244868|-4.8467723|159.0707489 unknown
InChI: InChI=1S/C18H18O5/c1-20-12-7-14(21-10-11-5-3-2-4-6-11)17-13-9-16(19)23-18(13)22-15(17)8-12/h2-8,13,15,17-18H,9-10H2,1H3
charge 0 multiplicity 1
41 atoms
O  3.066339 0.058394 1.214269
O  3.389251 -2.339201 1.111696
O  -0.923809 0.282752 -0.374807
O  3.336928 -4.234921 -0.233173
O  2.329103 3.992938 -0.861935
C  1.217582 -1.356428 0.537116
C  1.419309 -0.227803 -0.540527
C  2.455426 -1.191307 1.476543
C  2.853199 0.325967 -0.285065
C  1.303587 -2.801159 0.007912
C  0.350896 0.847039 -0.469367
C  3.08327 1.767399 -0.573204
C  2.757067 -3.240395 0.231906
C  0.628889 2.187304 -0.548428
C  2.024396 2.634477 -0.659031
C  -2.092731 1.211182 -0.362439
C  -3.346688 0.377972 -0.265833
C  1.242316 4.95161 -1.073682
C  -3.899854 -0.220878 -1.425921
C  -3.98015 0.174615 0.985244
C  -5.064123 -1.014445 -1.336239
C  -5.14736 -0.616353 1.07807
C  -5.690978 -1.212571 -0.083235
H  0.279855 -1.180572 1.083187
H  1.367894 -0.674192 -1.552976
H  2.285815 -1.274659 2.559717
H  3.594235 -0.311357 -0.802646
H  1.030481 -2.919143 -1.052728
H  0.654514 -3.485574 0.585291
H  4.105905 2.142769 -0.650759
H  -0.172222 2.929824 -0.534154
H  -2.063827 1.807658 -1.296499
H  -1.987926 1.893108 0.504406
H  0.604366 5.054858 -0.174093
H  0.619171 4.683268 -1.948817
H  1.749292 5.908787 -1.266417
H  -3.414005 -0.069038 -2.397304
H  -3.557257 0.633243 1.887477
H  -5.483931 -1.473947 -2.237679
H  -5.630926 -0.766245 2.049487
H  -6.596802 -1.824978 -0.013361
