program: Gaussian 09
title: 000273510
version: EM64L-G09RevD.01
frameworkgroup: C1[X(C22H22N4)]
method: RPBEPBE
basis: SDD
operation: Freq
keyword: #pfreq=noraman
keyword: PBEPBE/SDD
title: #p freq=noraman PBEPBE/SDD
converged: YES YES NO NO
title: Mulliken charges:
elementType: N N N N C C C C C C C C C C C C C C C C C C C C C C H H H H H H H H H H H H H H H H H H H H H H
charge: -0.079048 0.016837 -0.469662 -0.026083 -0.384605 -0.214362 -0.172481 -0.465902 0.381144 -0.370212 -0.494482 0.091270 0.429826 -0.822881 -0.280675 -0.379214 -0.433427 -0.209973 -0.221400 -0.266805 0.453338 -0.429297 -0.336346 -0.193654 -0.206701 -0.274640 0.305758 0.253046 0.253704 0.245643 0.217776 0.271621 0.227302 0.210589 0.259420 0.236946 0.236724 0.271388 0.229503 0.289862 0.236823 0.224495 0.228565 0.212460 0.274397 0.220847 0.226643 0.225923
chargesum: 0.00000
title: Mulliken charges with hydrogens summed into heavy atoms:
elementType: N N N N C C C C C C C C C C C C C C C C C C C C C C
charge: -0.079048 0.016837 -0.179800 -0.026083 -0.078848 0.038684 0.081223 -0.002482 0.381144 -0.098591 -0.056592 0.091270 0.429826 -0.089790 -0.280675 -0.107826 -0.203924 0.026850 0.003095 -0.038240 0.453338 -0.216837 -0.061950 0.027193 0.019942 -0.048717
polarizability: 3.43205389e+02 -2.82051405e+01 2.53799705e+02 -1.10071279e+00 3.87020286e+01 1.96616568e+02
1716.lowfreq: -8.6511 -6.4541 -0.0002 0.0004 0.0005 4.7149 17.5853 23.1719 25.4541
frequency: 17.3173 22.8364 25.3022 32.7662 53.1850 68.9307 74.3634 76.3447 97.9212 127.9816 156.2836 183.3373 189.9657 206.3860 227.1407 234.7669 258.5642 268.4994 298.0262 305.5998 359.2008 376.3625 406.1809 407.9540 425.1205 443.0051 462.1558 491.8341 500.1479 508.6698 543.1504 548.9331 561.2264 582.5456 592.2249 612.9314 615.8725 631.1024 658.5820 694.1740 702.5381 708.9200 737.8841 757.2282 771.7094 789.1369 810.8925 828.5949 842.0505 849.1919 858.7616 859.9917 868.6465 894.2120 906.9982 913.2118 918.9417 940.5076 961.5527 970.8366 980.3706 981.4955 984.7769 986.1658 990.4278 993.8646 1002.6980 1004.1034 1020.3977 1026.0528 1026.4926 1066.3100 1079.0561 1079.9857 1097.6137 1121.8644 1131.2510 1163.7887 1167.7579 1171.0389 1172.1203 1178.5700 1185.4370 1186.6846 1207.0184 1211.7156 1218.2691 1241.9660 1255.3805 1257.7159 1271.4447 1281.4730 1292.9027 1313.2170 1316.5063 1338.0183 1357.1241 1383.2173 1386.5570 1388.3787 1433.4606 1440.9451 1455.3916 1464.0268 1464.9128 1475.3083 1484.3305 1485.6579 1519.9666 1587.1103 1592.9153 1594.0405 1601.9206 1615.5451 1617.8580 2159.7025 2901.8811 2947.7760 2970.0833 2986.6753 3015.5678 3026.5584 3093.3671 3097.2450 3100.0653 3108.4089 3112.2821 3126.2729 3129.0901 3139.9090 3140.4587 3148.3740 3153.2418 3163.4861 3165.6045 3187.6807 3189.1451 3447.8926
redmass: 4.5024 4.2348 4.8434 5.8538 5.5298 4.0257 4.5398 6.0109 4.2641 5.6826 1.2509 3.2331 4.3982 5.5089 3.8434 3.9224 2.9945 3.6805 2.5131 4.3635 5.3251 4.7650 2.8634 2.9267 1.6032 3.3595 2.9305 2.7222 6.3098 3.0549 4.6640 4.7760 2.9669 4.8811 4.4288 6.3083 6.3230 6.2126 4.0975 1.9417 2.5734 2.7344 1.6795 1.7172 3.2618 4.4921 3.7940 1.2624 3.5519 1.7931 1.3916 2.8512 2.1118 1.4452 2.6723 2.8269 1.8082 2.5029 1.3525 2.1283 1.6028 3.9565 1.5675 1.3980 5.2313 1.6275 1.4699 3.7396 2.1153 1.7910 2.0997 2.8370 1.6972 1.8129 1.8661 3.5362 2.6274 1.6785 1.0660 1.2814 1.0582 1.1446 1.2623 1.2387 1.4762 1.8253 1.9572 2.0471 1.3302 1.3784 1.6223 1.7211 1.5629 1.4210 1.4048 1.9649 1.6466 1.2447 5.7004 4.1785 2.0832 2.0876 1.0886 1.2071 1.1296 1.0537 2.1966 2.2185 1.7738 7.6327 6.2503 6.1071 5.8503 6.0627 6.2522 12.6020 1.0666 1.0403 1.0829 1.0906 1.0971 1.0594 1.1008 1.0959 1.0945 1.0876 1.0870 1.0873 1.0867 1.0932 1.0920 1.0918 1.0958 1.0990 1.0998 1.0991 1.0944 1.0744
irintensity: 0.4132 0.1704 0.4999 0.4435 0.1709 0.2069 1.7334 1.6839 3.1198 0.1949 3.8435 4.2456 0.3132 1.7570 2.8940 1.2062 1.0473 1.4552 4.3387 3.0046 1.5808 3.4786 0.0967 0.1113 37.3837 1.6822 11.8011 11.5318 3.8620 8.9635 3.9419 1.6177 23.9802 5.6490 4.1805 0.1408 1.2071 5.8844 17.2276 47.9167 28.4785 7.9740 65.5828 73.4678 50.8350 11.8828 7.2939 1.4665 9.5878 20.3663 0.6912 5.7325 13.2769 9.5158 2.6828 7.6342 3.7485 3.1375 0.2579 3.9060 0.2835 3.5074 3.7502 2.0951 0.1154 5.0968 3.0678 8.2747 6.0926 3.7397 7.8858 7.0521 6.9400 24.1043 29.2894 98.3094 12.9744 8.2057 3.2574 8.1278 0.1987 9.2865 9.0040 3.5534 4.7509 0.8298 5.0273 13.8791 7.1673 1.1834 58.2018 79.6668 6.7924 0.4739 25.5919 5.6289 8.6048 26.0635 23.1376 3.2857 5.6492 9.0130 9.3201 37.1471 8.1012 13.6686 12.9857 103.4781 77.7093 1.9343 39.1044 2.5522 3.0897 2.0268 177.0543 55.2122 52.2595 27.1397 18.0021 18.7168 17.1942 38.1162 30.9950 29.8531 13.1328 15.4179 7.5009 4.0455 0.3385 50.6828 7.9673 1.1115 28.7535 35.5902 10.6003 5.7307 1.8509 4.2208
temp: 298.150 k
press: 1.00000 atm
elementType: 7 7 7 7 6 6 6 6 6 6 6 6 6 6 6 6 6 6 6 6 6 6 6 6 6 6 1 1 1 1 1 1 1 1 1 1 1 1 1 1 1 1 1 1 1 1 1 1
symmnumber: 1
zpe: 1017436.4 jmol-1
zpe.correction: 0.387521 hartree
zpe.thermalcorrener: 0.410364 hartree
zpe.thermalcorrenthalpy: 0.411309 hartree
zpe.thermalcorrgfe: 0.332716 hartree
zpe.sumelectzpe: -1068.617527 hartree
zpe.sumelectthermal: -1068.594684 hartree
zpe.sumelectthermalent: -1068.593740 hartree
zpe.sumelectthermalfe: -1068.672332 hartree
dipole: 0.3813 -3.0443 -5.1605
dipole: 6.0037
quadrupole: -142.1763 -132.2946 -173.0964
quadrupole: 0.4244 -16.3469 11.5997
quadrupole: 7.0128 16.8945 -23.9073 0.4244 -16.3469 11.5997
hfenergy: -1069.0050485 hartree
pointgroup: C01 [X(C22H22N4)]
dipole: -0.2368881 1.0642501 -2.0953334 debye
polarizability: 347.3666333|-19.2334944|245.0636708|6.920864|-41.340577|201.1913579 unknown
InChI: InChI=1S/C22H22N4/c1-16(24-25-19-10-6-3-7-11-19)21-13-20-12-18(14-23)22(21)26(20)15-17-8-4-2-5-9-17/h2-12,20-22,25H,13,15H2,1H3
charge 0 multiplicity 1
48 atoms
N  -2.072834 -0.308205 -0.98018
N  0.604156 1.748436 -0.132705
N  1.857245 2.269219 -0.384442
N  -3.72542 0.348617 3.567928
C  -1.886593 0.412098 0.322893
C  -3.356786 0.389483 -1.340945
C  -1.834767 1.908591 -0.169748
C  -2.830141 1.866988 -1.397995
C  -3.300946 0.283997 0.984121
C  -4.19866 0.278882 -0.05182
C  -2.165575 -1.790384 -0.919567
C  -0.451779 2.443541 -0.505949
C  -0.836249 -2.469871 -0.611814
C  -0.370257 3.806455 -1.179499
C  -3.559386 0.321476 2.380622
C  0.395965 -1.919911 -1.044026
C  -0.83182 -3.711745 0.072387
C  1.607615 -2.607838 -0.807755
C  0.377991 -4.404238 0.303659
C  1.603277 -3.854636 -0.139896
C  3.023512 1.606519 0.051282
C  4.285847 2.198824 -0.228477
C  2.964802 0.376716 0.758682
C  5.472257 1.56718 0.197813
C  4.161015 -0.242684 1.175158
C  5.421339 0.341593 0.903249
H  -1.022703 0.082912 0.910527
H  -3.824201 0.024764 -2.266929
H  -2.254633 2.56386 0.620986
H  -2.291291 2.016036 -2.348388
H  -3.643723 2.607852 -1.322004
H  -5.288587 0.292862 0.017039
H  -2.513587 -2.114953 -1.92152
H  -2.931445 -2.138078 -0.187345
H  -1.373767 4.232238 -1.33424
H  0.205711 4.53054 -0.565809
H  0.121627 3.748891 -2.172682
H  0.393488 -0.947712 -1.547645
H  -1.779061 -4.138055 0.427129
H  1.968237 3.170715 -0.86241
H  2.554398 -2.165417 -1.137124
H  0.365052 -5.363765 0.833202
H  2.543986 -4.387575 0.039502
H  4.337366 3.149858 -0.775119
H  1.991407 -0.072683 0.966671
H  6.438621 2.035337 -0.021916
H  4.103847 -1.191841 1.720636
H  6.343941 -0.146087 1.234767
