program: Gaussian 09
title: 000273485
version: EM64L-G09RevD.01
frameworkgroup: C1[X(C9H10N6)]
method: RPBEPBE
basis: SDD
operation: Freq
keyword: #pfreq=noraman
keyword: PBEPBE/SDD
title: #p freq=noraman PBEPBE/SDD
converged: YES YES NO NO
title: Mulliken charges:
elementType: N N N N N N C C C C C C C C C H H H H H H H H H H
charge: -0.250079 -0.128218 -0.682441 -0.126099 -0.588013 -0.584567 0.147092 0.306940 0.123052 -0.320846 -0.406040 -0.282261 -0.201282 0.060618 0.011447 0.274003 0.210995 0.223730 0.220011 0.383428 0.287023 0.333397 0.324494 0.331114 0.332500
chargesum: 0.00000
title: Mulliken charges with hydrogens summed into heavy atoms:
elementType: N N N N N N C C C C C C C C C
charge: -0.250079 -0.128218 -0.011990 -0.126099 0.069879 0.079047 0.147092 0.306940 0.123052 -0.046843 -0.195044 -0.058531 0.018729 0.060618 0.011447
polarizability: 2.33515813e+02 9.50258830e-01 1.75084094e+02 2.14614626e-02 6.19908581e-02 5.72099252e+01
1716.lowfreq: -4.7893 0.0005 0.0007 0.0007 5.6082 8.3338 48.3795 81.6124 143.8745
frequency: 48.3795 81.6120 143.8744 171.0580 186.8070 200.2500 267.0041 272.6301 312.8486 345.4193 423.7062 438.2039 454.1504 459.9743 481.4732 520.6655 530.9032 534.6037 546.2821 548.3258 576.1831 595.2397 651.9241 683.3916 710.5619 755.9050 762.7012 799.7446 814.9704 853.7406 864.3499 877.1515 916.5267 962.6662 982.1528 989.7112 997.6653 1031.7582 1064.9456 1127.6922 1144.3809 1167.4061 1173.8983 1248.7759 1278.5567 1333.5438 1362.6385 1385.3944 1419.3420 1463.4980 1477.0111 1492.3335 1510.2064 1514.9704 1550.8018 1592.2068 1597.9581 1627.5477 1632.4138 3114.3442 3135.3879 3153.0393 3173.4297 3217.7958 3555.6444 3558.4845 3628.4178 3716.5108 3717.1351
redmass: 4.5179 5.2262 4.6659 5.7140 5.4566 7.4451 4.1811 4.1094 4.2231 3.6435 1.4851 3.0449 1.7567 1.3000 1.2428 3.4994 2.1115 1.2860 6.2735 1.0459 7.7095 7.2216 6.2211 4.4782 10.4289 3.3839 1.4971 4.0472 5.4835 1.6911 1.2028 4.7198 11.0722 1.3504 2.3435 1.3273 3.5477 2.0981 1.7467 2.4775 1.4542 2.0887 1.1183 5.0243 2.0425 2.0098 3.9315 4.2688 7.4783 3.0836 4.2835 3.4305 2.1670 4.6192 2.0137 1.9994 1.4391 4.3557 2.4735 1.0860 1.0913 1.0936 1.0974 1.0649 1.0440 1.0445 1.0878 1.1058 1.1056
irintensity: 0.0188 4.0877 1.0534 0.0002 16.3205 0.1599 1.2253 0.9282 5.6184 8.9315 11.3844 6.9852 21.0790 253.4686 390.1875 3.1537 47.0803 31.4753 0.3755 2.3422 5.3270 11.9258 9.3573 0.7042 1.3031 0.9283 143.7228 0.0236 2.5746 12.0341 90.9458 16.5050 0.5102 2.0442 1.4295 0.4193 3.6528 4.0590 19.8389 0.8051 1.6009 12.8353 30.4470 11.2263 65.2822 72.8580 295.3029 9.3950 2.9189 13.8650 641.0831 261.4609 161.6665 649.0066 20.3090 157.2192 688.8040 307.0267 87.5438 8.7069 27.7102 21.0688 20.8159 252.4349 126.4995 88.4375 52.2341 36.4765 49.8213
temp: 298.150 k
press: 1.00000 atm
elementType: 7 7 7 7 7 7 6 6 6 6 6 6 6 6 6 1 1 1 1 1 1 1 1 1 1
symmnumber: 1
zpe: 507995.6 jmol-1
zpe.correction: 0.193485 hartree
zpe.thermalcorrener: 0.205997 hartree
zpe.thermalcorrenthalpy: 0.206941 hartree
zpe.thermalcorrgfe: 0.155043 hartree
zpe.sumelectzpe: -676.458971 hartree
zpe.sumelectthermal: -676.446460 hartree
zpe.sumelectthermalent: -676.445515 hartree
zpe.sumelectthermalfe: -676.497413 hartree
dipole: -2.0473 1.8703 0.0109
dipole: 2.7730
quadrupole: -70.4012 -62.9771 -94.2090
quadrupole: 3.4554 0.0308 0.0344
quadrupole: 5.4612 12.8854 -18.3465 3.4554 0.0308 0.0344
hfenergy: -676.6524565 hartree
pointgroup: C01 [X(C9H10N6)]
dipole: 0.819535 -0.5485633 -0.4665414 debye
dipolederiv: -1.7455333 0.3469254 0.2745681 0.3399596 -0.5363324 -0.2979928 0.2677543 -0.2973332 -0.4591726 -1.8275268 -0.4298161 -0.4283225 -0.3991313 -0.552233 -0.3200812 -0.4020298 -0.3212578 -0.5081435 -0.4190542 0.3041735 0.2750711 0.0243077 -0.930639 -0.2605993 0.0249286 -0.256135 -0.8703054 -0.8328303 -0.0265531 -0.0384117 0.0599906 -0.8944363 -0.5686855 0.0397568 -0.5708841 -0.7778612 -0.6710396 0.4174405 0.3789886 0.5611449 -0.9728232 -0.2147761 0.508628 -0.218475 -0.9041227 -0.7446195 -0.462671 -0.4178662 -0.5976375 -0.9592441 -0.2348565 -0.5398935 -0.2313874 -0.9388719 -1.2079865 -0.1907259 -0.1979937 0.2854018 -0.2007768 -0.0808799 0.2278065 -0.0921835 -0.1795213 0.2513915 -0.4509291 -0.3994422 0.0285891 0.6666484 0.4879047 0.0310785 0.4770688 0.5507185 2.3497927 0.1170777 0.1611274 0.0140583 0.5461458 0.3995574 0.0694375 0.4015896 0.4691959 0.5609775 0.0527571 0.0627968 -0.4515313 -0.0266338 0.047714 -0.3887158 0.0605955 -0.0479529 0.007875 0.3990163 0.3619076 0.012408 -0.2156883 0.0141889 0.0160613 0.0227871 -0.2107188 -0.7227965 -0.158782 -0.1531307 -0.1924506 -0.1532498 0.0753868 -0.1822444 0.0761755 -0.1806191 0.1723636 -0.0038339 0.0031095 0.3215269 0.1600514 0.2516297 0.2928303 0.2436706 0.1111899 1.615034 -0.3791917 -0.3074665 -0.5116896 1.0645772 0.7451774 -0.4279897 0.747988 0.8912875 1.8102423 0.4694848 0.4637473 0.4317075 1.0464396 0.760773 0.4316202 0.7616979 0.9139207 0.137384 -0.0666503 -0.0593549 -0.0432492 0.0750643 -0.0623326 -0.0384315 -0.0632465 0.0865403 0.0044647 -0.0437268 -0.0428077 -0.100105 0.0190049 -0.1338285 -0.0930173 -0.1326546 0.0460958 0.0131114 0.0592765 0.048774 0.08295 0.0220541 -0.1342011 0.0699268 -0.1346369 0.0569726 -0.167802 0.0167224 0.0074209 0.0193618 0.1206716 -0.0246164 0.0101542 -0.0245764 0.1272044 0.5313168 0.0723814 0.069623 0.1191525 0.2544055 -0.0616945 0.1108479 -0.0624646 0.2739965 0.0897817 -0.0425443 -0.0431747 -0.0118077 0.2718781 -0.0804339 -0.01551 -0.0795808 0.2912066 0.2365916 -0.0468526 -0.0462877 -0.0362885 0.2849352 -0.0920763 -0.0369655 -0.0921185 0.30163 0.158668 -0.0269894 -0.0300134 -0.0515352 0.3079857 -0.0666321 -0.0523048 -0.0657598 0.3197118 0.2407351 0.055355 0.0461582 0.0364852 0.2820078 -0.0930464 0.0292953 -0.0924067 0.3037562 0.1594588 0.0186557 0.0109794 0.0583821 0.320187 -0.055599 0.046976 -0.0564721 0.3338627 unknown
polarizability: 233.3963582|-0.6060521|122.5346658|3.8130288|58.5964814|109.8788082 unknown
InChI: InChI=1S/C9H10N6/c10-6-4-2-1-3-5(6)7-13-8(11)15-9(12)14-7/h1-4H,10-12H2
charge 0 multiplicity 1
25 atoms
N  1.023875 -0.788387 -0.758646
N  1.055217 1.010449 0.864053
N  -1.350816 -1.646005 -1.577025
N  3.160077 0.058522 0.060851
N  3.065677 -1.672684 -1.505288
N  3.121487 1.796571 1.627241
C  -1.094166 0.179153 0.060202
C  -1.914294 -0.700627 -0.743969
C  0.377759 0.13027 0.052288
C  -1.737962 1.137131 0.898558
C  -3.338999 -0.572124 -0.662581
C  -3.133806 1.249876 0.96559
C  -3.935231 0.381555 0.172985
C  2.398539 -0.773831 -0.710411
C  2.421293 0.929486 0.827572
H  -1.089151 1.785903 1.493682
H  -3.962149 -1.239045 -1.271605
H  -3.600678 1.994962 1.617443
H  -5.028637 0.454945 0.212781
H  -0.314135 -1.680938 -1.58551
H  -1.941907 -2.259269 -2.132575
H  4.08217 -1.681848 -1.486763
H  2.541986 -2.311986 -2.09618
H  4.137519 1.764924 1.624728
H  2.608032 2.454799 2.207279
