program: Gaussian 09
title: 000273484
version: EM64L-G09RevD.01
frameworkgroup: C1[X(C9H8N6O2)]
method: RPBEPBE
basis: SDD
operation: Freq
keyword: #pfreq=noraman
keyword: PBEPBE/SDD
title: #p freq=noraman PBEPBE/SDD
converged: YES YES NO NO
title: Mulliken charges:
elementType: O O N N N N N N C C C C C C C C C H H H H H H H H
charge: -0.213430 -0.182129 -0.075736 -0.075746 0.025074 -0.111876 -0.583683 -0.583690 0.377096 0.162935 -0.070069 -0.344203 -0.361634 -0.225114 -0.206522 0.051335 0.051381 0.254558 0.286939 0.239245 0.241697 0.334192 0.337597 0.334192 0.337590
chargesum: 0.00000
title: Mulliken charges with hydrogens summed into heavy atoms:
elementType: O O N N N N N N C C C C C C C C C
charge: -0.213430 -0.182129 -0.075736 -0.075746 0.025074 -0.111876 0.088106 0.088093 0.377096 0.162935 -0.070069 -0.089645 -0.074695 0.014132 0.035174 0.051335 0.051381
polarizability: 2.01315434e+02 -9.07688542e+00 1.33228524e+02 1.07360670e-01 9.56878491e-02 1.21589270e+02
1716.lowfreq: -29.3569 -7.0310 -4.2513 -0.0010 -0.0005 -0.0003 4.3799 60.5446 61.3452
frequency: -29.3516 60.5402 61.3287 79.5958 136.0175 189.2218 190.2121 197.5822 249.3039 279.3287 299.3518 327.5469 403.1628 418.4896 449.0349 489.7035 500.2477 515.4935 548.9976 550.6736 551.1902 565.5740 591.5781 641.1830 666.4371 681.0308 702.5318 720.9000 749.2462 784.0221 787.1289 815.2483 867.7538 890.5332 906.1482 972.8601 983.4023 988.1721 1002.4606 1035.3991 1064.5020 1131.6906 1138.5091 1166.2655 1176.0666 1211.4304 1251.0058 1263.8179 1364.4707 1378.9573 1385.1812 1413.1442 1428.9580 1465.9963 1492.4933 1513.8564 1527.9348 1580.8767 1599.2026 1616.5493 1630.5290 3141.9865 3157.0631 3170.5947 3187.9342 3553.4373 3555.2955 3714.1978 3714.4530
redmass: 7.2771 7.5113 7.0364 5.7465 5.3522 6.0717 7.6647 7.9628 6.3771 4.4747 6.7279 3.3285 8.9800 3.3494 3.2415 1.2052 1.4100 4.7018 1.0611 1.2052 3.4948 3.6557 7.3564 6.8313 4.9664 7.9094 8.6332 11.8231 3.6629 1.4448 9.6828 12.0947 5.9484 1.4050 7.3667 1.6426 2.6977 2.2873 1.3444 2.6867 2.9743 2.4347 1.8905 2.0664 1.2544 10.9923 6.0961 1.5035 6.3117 5.1816 6.1726 5.1267 2.5179 3.7500 4.6754 1.9842 4.2381 6.5311 1.4947 5.3829 2.3257 1.0865 1.0916 1.0973 1.0968 1.0440 1.0445 1.1059 1.1058
irintensity: 0.2616 3.8667 1.8139 1.4441 0.0341 9.9326 0.0059 5.1843 0.4221 1.1637 4.7579 15.1657 5.7914 0.0733 0.6256 2.2549 476.4788 80.9476 4.5169 0.1151 7.2847 2.5415 8.9993 6.8576 18.2321 10.5954 6.0765 0.0140 15.2630 60.6184 10.6790 46.5369 2.0490 0.0058 17.9247 2.6057 0.4504 5.7558 0.1798 2.9008 15.3271 0.0254 3.0172 11.1807 3.1689 219.8502 18.3234 0.9881 67.4791 226.2547 10.7187 4.7683 8.1211 269.5255 275.9730 28.2193 557.5546 14.9648 704.3265 33.4382 205.7472 1.7899 12.3100 11.6625 8.1192 164.5528 64.5523 25.3473 75.4666
temp: 298.150 k
press: 1.00000 atm
elementType: 8 8 7 7 7 7 7 7 6 6 6 6 6 6 6 6 6 1 1 1 1 1 1 1 1
symmnumber: 1
zpe: 465616.7 jmol-1
zpe.correction: 0.177344 hartree
zpe.thermalcorrener: 0.190664 hartree
zpe.thermalcorrenthalpy: 0.191608 hartree
zpe.thermalcorrgfe: 0.137251 hartree
zpe.sumelectzpe: -825.459568 hartree
zpe.sumelectthermal: -825.446248 hartree
zpe.sumelectthermalent: -825.445304 hartree
zpe.sumelectthermalfe: -825.499661 hartree
dipole: -1.3437 -4.2520 0.0233
dipole: 4.4593
quadrupole: -72.5007 -103.3354 -83.9280
quadrupole: -9.6593 0.0465 0.1423
quadrupole: 14.0873 -16.7474 2.6600 -9.6593 0.0465 0.1423
hfenergy: -825.6369122 hartree
pointgroup: C01 [X(C9H8N6O2)]
dipole: 0.4746033 1.689014 0.0007679 debye
dipolederiv: -0.6856744 -0.1986343 0.0008962 -0.3039877 -0.8208799 0.0005731 0.0013097 0.0005472 -0.2300854 -0.8603659 0.0662951 0.001434 0.019367 -0.5709927 -0.0004624 0.0014723 -0.0000804 -0.1717184 -1.400633 0.0244156 -0.5448218 0.0674468 -0.1925125 0.0368171 -0.2918772 -0.0447879 -0.8944208 -1.4009419 0.0216667 0.5450709 0.0666654 -0.1924359 -0.0331401 0.2916643 0.0481487 -0.8939203 1.3173218 -0.0467005 -0.002816 0.0260542 1.5681026 -0.0002244 -0.0030594 -0.0004532 0.1768386 -0.6175873 0.0125994 0.0004228 0.0538909 -0.2421668 0.0031805 0.0005443 0.0030878 -1.4644627 -0.612383 -0.0357942 -0.606474 -0.0388936 -0.6752153 0.0181872 -0.6620228 0.0243191 -1.2100362 -0.6133729 -0.0388965 0.6070027 -0.042334 -0.6750718 -0.0155806 0.6622084 -0.0217327 -1.2094828 0.0188347 0.1184809 0.0000829 -0.1903762 0.1303746 0.0000116 0.0004388 -0.0003869 0.0036341 0.0217164 0.1873032 0.0004418 0.192772 -0.5202053 -0.0000545 -0.0000992 -0.0001383 0.0505567 1.4687538 0.0208195 -0.0001309 0.1720956 0.2089523 -0.0024907 0.0004823 -0.0020079 1.1454842 -0.2546842 0.2001549 0.0000545 0.2010805 -0.0131325 0.0000092 0.0000636 -0.0002306 -0.1089686 -0.1032396 -0.1982482 -0.000081 0.0625908 0.0771971 -0.0000139 -0.0001817 0.0004205 -0.0942064 0.118453 -0.0410477 -0.0000227 0.0041145 0.1761626 -0.0000039 -0.0001076 0.0000636 -0.1092612 0.1402031 -0.0646871 -0.0001261 -0.1211502 -0.2403053 -0.0000257 -0.0002151 0.000093 -0.1517399 1.2839593 -0.0480383 0.5851321 -0.1229779 0.2064933 -0.0454871 0.5988036 -0.0163072 1.7850965 1.2846298 -0.0450431 -0.5862343 -0.1203191 0.2061922 0.0373645 -0.5999501 0.0082548 1.784701 0.038369 -0.0908049 0.0000059 -0.0834364 0.0122317 -0.0000436 -0.0000709 0.0000703 0.1354964 0.0867563 -0.0270836 -0.0000411 -0.0681925 0.0757013 -0.000015 0.0001876 -0.0001431 0.167768 0.054289 0.0615596 0.0000248 0.0792999 -0.0737576 -0.0000405 0.0000815 -0.0000542 0.1536711 -0.1026698 0.0430667 0.0000701 0.0302785 0.0769933 -0.0000268 0.0000865 -0.0000575 0.1579365 0.2379662 0.0201379 0.0767008 0.029008 0.3738291 0.0014083 0.0403679 -0.0022578 0.2028648 0.1710837 0.0189261 0.0062166 0.028739 0.3652547 0.017688 0.0594608 0.0026809 0.2857962 0.2380543 0.0205352 -0.0765905 0.0292209 0.3738246 -0.000461 -0.0401983 0.0031781 0.2027899 0.1711614 0.0190175 -0.0062178 0.0290434 0.3653663 -0.0171694 -0.0593891 -0.0022262 0.2856687 unknown
polarizability: 201.8283148|-6.8711287|132.7143861|-0.0691103|-0.1544546|121.5905282 unknown
InChI: InChI=1S/C9H8N6O2/c10-8-12-7(13-9(11)14-8)5-3-1-2-4-6(5)15(16)17/h1-4H,10-11H2
charge 0 multiplicity 1
25 atoms
O  -2.313643 -2.840745 0.002022
O  -0.143021 -2.160392 -0.003689
N  1.180474 0.346468 1.215426
N  1.181458 0.35281 -1.214592
N  -1.409285 -1.917042 -0.000446
N  3.291868 0.113966 0.000668
N  3.223562 0.139276 2.343292
N  3.225481 0.151522 -2.341839
C  -0.924145 0.562953 0.000135
C  -1.862848 -0.499622 0.000228
C  0.569342 0.381156 0.000248
C  -1.435158 1.88264 0.000376
C  -3.258108 -0.270573 0.000703
C  -2.824764 2.130653 0.000773
C  -3.739582 1.051539 0.000978
C  2.553781 0.200063 1.151357
C  2.554724 0.206081 -1.150147
H  -0.728402 2.718146 0.000269
H  -3.931177 -1.131448 0.000778
H  -3.19142 3.162504 0.000947
H  -4.817952 1.239002 0.001294
H  4.233083 0.018893 2.342142
H  2.689048 0.166305 3.207833
H  4.235003 0.031143 -2.340486
H  2.691681 0.183105 -3.206667
