program: Gaussian 09
title: 000273483
version: EM64L-G09RevD.01
frameworkgroup: C1[X(C9H8BrN5)]
method: RPBEPBE
basis: SDD
operation: Freq
keyword: #p
keyword: freq=noraman
keyword: PBEPBE/SDD
title: #p freq=noraman PBEPBE/SDD
converged: YES YES NO NO
title: Mulliken charges:
elementType: Br N N N N N C C C C C C C C C H H H H H H H H
charge: -0.009098 -0.127346 -0.128519 -0.113955 -0.581024 -0.580597 0.301385 0.044015 -0.285458 -0.354542 -0.198204 -0.217195 -0.200947 0.024571 0.027424 0.293776 0.279155 0.234238 0.252026 0.334620 0.334481 0.334452 0.336743
chargesum: 0.00000
title: Mulliken charges with hydrogens summed into heavy atoms:
elementType: Br N N N N N C C C C C C C C C
charge: -0.009098 -0.127346 -0.128519 -0.113955 0.088077 0.090598 0.301385 0.044015 0.008318 -0.075387 -0.198204 0.017042 0.051079 0.024571 0.027424
polarizability: 2.39364618e+02 4.01590292e+00 1.78261106e+02 -2.99255230e-02 -4.02399487e-03 5.60785123e+01
1716.lowfreq: -8.0385 -6.9900 -0.0003 -0.0001 0.0006 4.5041 28.5945 76.7024 79.7345
frequency: 28.5793 76.7024 79.7343 164.4001 184.5494 184.9620 186.0959 230.1368 269.5335 298.4968 345.0173 375.5846 431.2928 488.4604 495.5091 513.2465 520.6165 550.9854 552.2108 567.0662 590.2007 642.9338 673.6957 700.2166 716.1885 721.7345 797.1165 820.4720 877.0549 909.5303 930.2961 945.5451 981.9960 988.8099 996.3996 999.6716 1060.4321 1087.0601 1129.8329 1162.0728 1176.8966 1253.3152 1272.7754 1361.7199 1375.4256 1397.1062 1426.1919 1461.3303 1479.2458 1513.3297 1520.4373 1569.7233 1598.2552 1601.7617 1628.1141 3142.8170 3169.4605 3177.9922 3181.2340 3553.8339 3555.6615 3714.4586 3715.0903
redmass: 5.9709 8.5824 5.5732 5.5023 7.5021 7.4481 5.9713 5.0276 5.8150 4.7042 3.8717 4.0600 3.0650 1.2193 1.5745 2.7311 3.7198 1.0567 1.0312 7.2143 7.4776 6.9551 3.6950 7.9027 11.5142 2.9535 2.2033 3.2650 5.0368 8.3985 1.3432 1.4807 5.4553 3.6019 2.3943 1.3495 2.0180 1.5334 2.4514 1.9080 1.3858 5.0611 1.3852 3.6844 7.2747 4.3663 3.6992 3.0319 5.9111 2.0481 4.3647 6.9034 1.4742 6.0681 2.1041 1.0878 1.0929 1.0947 1.0954 1.0440 1.0445 1.1059 1.1058
irintensity: 0.0092 0.4247 3.6254 0.0824 1.8881 0.5246 8.5536 3.9474 3.5238 0.9370 9.6954 4.8796 0.1051 36.9981 380.4665 179.3444 0.5319 6.9459 1.4004 2.9913 11.9387 8.6037 25.9806 60.1502 0.0633 10.2452 89.2966 0.9095 8.5378 7.1370 1.4979 12.3697 12.3660 1.0660 7.6022 0.9854 16.3724 8.9287 0.1621 31.5225 1.7280 7.9434 22.7410 215.8157 12.5666 43.9834 9.2720 88.7976 589.0932 88.3654 579.2356 17.9146 644.7888 16.0306 282.2981 8.7215 2.0623 2.8155 11.2769 149.0616 78.9358 37.4346 58.5259
temp: 298.150 k
press: 1.00000 atm
elementType: 35 7 7 7 7 7 6 6 6 6 6 6 6 6 6 1 1 1 1 1 1 1 1
symmnumber: 1
zpe: 437358.4 jmol-1
zpe.correction: 0.166581 hartree
zpe.thermalcorrener: 0.179502 hartree
zpe.thermalcorrenthalpy: 0.180447 hartree
zpe.thermalcorrgfe: 0.125607 hartree
zpe.sumelectzpe: -633.963505 hartree
zpe.sumelectthermal: -633.950584 hartree
zpe.sumelectthermalent: -633.949639 hartree
zpe.sumelectthermalfe: -634.004479 hartree
dipole: 3.8068 0.5204 0.0038
dipole: 3.8422
quadrupole: -78.6510 -74.4864 -101.3207
quadrupole: -3.4225 -0.0116 -0.0215
quadrupole: 6.1683 10.3330 -16.5014 -3.4225 -0.0116 -0.0215
hfenergy: -634.1300861 hartree
pointgroup: C01 [X(C9H8Br1N5)]
dipole: 1.4154805 -0.5278275 0.0539057 debye
dipolederiv: -0.4112882 0.3001062 -0.0170186 0.4201764 -0.4549656 0.0208025 -0.0190353 0.0170095 -0.053883 -1.7229418 0.498429 -0.0595187 0.2190684 -0.7350294 0.0189032 -0.0539705 0.0275215 -0.1979999 -1.4482255 -0.5752517 -0.0276482 -0.4539808 -0.9507863 0.0020597 -0.0301983 -0.0018354 -0.1919707 -0.7469305 0.1257181 -0.0185112 0.0912299 -1.3965852 0.0276235 -0.0175642 0.0289131 -0.2587394 -0.8713157 0.6769401 -0.0197667 0.7764259 -1.0011357 0.0308726 -0.021295 0.0271008 -0.7132667 -0.4841617 -0.471791 0.0173406 -0.6331248 -1.3321126 -0.0068133 0.0205798 -0.0020413 -0.70859 -0.4169689 -0.0165806 -0.0123712 -0.1507092 0.0782919 -0.0066014 -0.0098791 -0.0023491 -0.0181523 1.825093 0.019409 0.0554609 0.1690857 0.9511326 -0.0138101 0.0525884 -0.0180551 0.0828119 -0.2493645 0.2167486 -0.0096996 0.1288042 -0.2228319 0.0067891 -0.0078127 0.0093731 -0.071021 -0.044225 -0.072535 0.0040484 0.098359 -0.0575094 0.00173 0.0005148 -0.0039581 -0.1245825 0.62161 -0.6731088 0.0361126 -0.9002131 0.7519217 -0.0447559 0.0399496 -0.037539 -0.1184402 -0.0243173 0.0225037 0.0036178 0.1670753 0.1170861 0.0003099 0.0010561 -0.00414 -0.149838 -0.1634204 0.1932525 -0.0056086 0.1621917 -0.2386282 0.0076683 -0.0050342 0.0086966 -0.0985485 1.6994041 -0.665316 0.0613643 -0.6547889 1.5772836 -0.0499284 0.0612382 -0.0501146 0.2280002 1.3316873 0.4868261 0.0248447 0.6126141 1.8840291 -0.0167296 0.0217962 -0.0207691 0.2248969 0.2044838 -0.0474978 0.0025329 -0.0286802 0.0316343 0.0014606 0.0022185 0.0009478 0.1528959 0.1239338 0.089315 -0.0027366 0.0822079 0.0357686 0.0049474 -0.0026194 0.0052683 0.1540567 0.022703 -0.0496797 -0.0034363 -0.0725915 -0.0978935 0.0025477 -0.0030774 0.003274 0.1589744 -0.063332 -0.0255388 -0.0067594 -0.015386 0.1077523 0.0005552 -0.0068817 0.0001646 0.1625822 0.1814995 -0.0350223 -0.0056322 -0.0821918 0.2663776 -0.0000351 -0.0047244 0.0016504 0.3841481 0.2576812 -0.069433 -0.0026272 -0.0384356 0.1850588 0.0031173 -0.0034343 0.0022025 0.386857 0.2227173 0.0746453 -0.0067601 0.0505923 0.2191068 0.00531 -0.006056 0.0062865 0.386211 0.1556784 -0.0021387 -0.0072276 0.0522707 0.2820342 0.0039769 -0.008359 0.0023931 0.3835979 unknown
polarizability: 234.5135714|-16.5985814|182.8586813|6.0017038|-3.100578|56.3319841 unknown
InChI: InChI=1S/C9H8BrN5/c10-6-3-1-2-5(4-6)7-13-8(11)15-9(12)14-7/h1-4H,11-12H2
charge 0 multiplicity 1
23 atoms
Br -4.352402 2.11718 -0.229203
N  1.400411 -1.209646 0.020028
N  1.044172 1.190355 -0.043226
N  3.321619 0.304514 0.048963
N  3.595404 -2.020774 0.107401
N  2.906365 2.60913 -0.014708
C  -0.875883 -0.323517 -0.072387
C  0.595715 -0.102807 -0.029557
C  -1.751221 0.793854 -0.122228
C  -1.407525 -1.638515 -0.063871
C  -3.136709 0.569212 -0.16194
C  -2.802748 -1.835409 -0.10518
C  -3.686552 -0.730381 -0.15472
C  2.752175 -0.942336 0.057799
C  2.414475 1.331158 -0.002489
H  -1.321026 1.798253 -0.128673
H  -0.710285 -2.479805 -0.024646
H  -3.215966 -2.849597 -0.09929
H  -4.769739 -0.878808 -0.186606
H  3.197797 -2.956381 0.115413
H  4.599871 -1.866281 0.13609
H  3.911983 2.755942 0.013595
H  2.253168 3.387359 -0.052966
