program: Gaussian 09
title: 000273482
version: EM64L-G09RevD.01
frameworkgroup: C1[X(C9H7N7)]
method: RPBEPBE
basis: SDD
operation: Freq
keyword: #p
keyword: freq=noraman
keyword: PBEPBE/SDD
title: #p freq=noraman PBEPBE/SDD
converged: NO NO NO NO
title: Mulliken charges:
elementType: N N N N N N N C C C C C C C C C H H H H H H H
charge: -0.351213 -0.130778 -0.084407 0.068206 -0.068028 -0.581763 -0.284248 0.174980 0.291434 0.066674 -0.322048 -0.307482 0.006800 -0.225635 -0.199378 -0.021935 0.282564 0.269986 0.241683 0.243863 0.336133 0.340272 0.254317
chargesum: 0.00000
title: Mulliken charges with hydrogens summed into heavy atoms:
elementType: N N N N N N N C C C C C C C C C
charge: -0.351213 -0.130778 -0.084407 0.068206 -0.068028 0.094643 -0.029931 0.174980 0.291434 0.066674 -0.039484 -0.037495 0.006800 0.016048 0.044485 -0.021935
polarizability: 2.39811167e+02 3.94946344e+00 1.78425970e+02 4.20095358e-03 6.11741113e-03 5.70251452e+01
1716.lowfreq: -9.6885 -7.6254 -5.4069 -0.0006 -0.0002 0.0002 10.1701 85.2157 132.3702
frequency: 4.2303 85.2146 132.3693 169.8132 182.3006 231.2868 263.9952 317.8697 336.1638 405.9017 420.3054 448.8149 462.2352 494.5719 517.0948 545.6718 559.2155 568.2115 600.7994 642.6347 653.1937 653.3482 689.3115 709.6877 742.1603 782.1866 790.0000 805.3024 829.8193 871.8406 902.0575 943.2729 950.4148 984.3263 988.2461 1010.6434 1020.7221 1101.5052 1133.7399 1155.2284 1170.6570 1188.3131 1232.4502 1254.8703 1292.6945 1379.6246 1393.0684 1412.3677 1444.7795 1467.7593 1531.7901 1554.7310 1580.3264 1609.9680 1613.7295 1634.6286 3144.6484 3159.7465 3175.0140 3182.2217 3380.4646 3558.1238 3717.4761
redmass: 6.7409 5.1639 6.9745 6.5111 4.9809 5.9036 8.6720 4.9871 4.1436 7.0988 3.5161 6.8674 3.8366 1.2122 9.1489 4.2964 1.1108 7.2733 5.0344 6.9669 8.8940 5.1657 8.1345 7.1055 7.1776 3.3656 1.6224 6.6885 1.1704 7.0866 1.4348 2.9234 8.6893 1.3742 4.0161 1.3463 2.1429 2.2063 2.1021 2.7088 1.3551 2.1386 2.8504 2.3330 2.7474 5.1344 4.7636 9.1748 2.5882 3.2920 3.2988 4.5336 6.3167 3.3151 4.1124 4.3603 1.0869 1.0909 1.0953 1.1000 1.0749 1.0444 1.1059
irintensity: 0.1527 2.1827 0.0028 1.7763 1.4538 0.2457 2.6211 1.7124 0.9610 6.1899 0.3769 9.3911 8.2753 225.7559 1.4248 20.1150 63.3504 2.7714 2.1930 7.3278 44.9620 3.7345 7.7921 108.8866 29.8560 51.1989 40.7691 36.8145 81.9408 5.2206 0.2929 132.5830 75.6354 2.8557 9.2451 0.0692 9.7420 2.5734 75.2624 69.1600 8.2972 7.7647 72.9553 10.0053 9.8428 19.4731 255.0947 35.7988 50.1377 93.0992 228.3195 233.0289 96.2009 611.8784 204.3638 98.2919 3.2117 7.8763 2.2548 17.3461 15.7956 139.0620 49.6370
temp: 298.150 k
press: 1.00000 atm
elementType: 7 7 7 7 7 7 7 6 6 6 6 6 6 6 6 6 1 1 1 1 1 1 1
symmnumber: 1
zpe: 425781.8 jmol-1
zpe.correction: 0.162172 hartree
zpe.thermalcorrener: 0.174185 hartree
zpe.thermalcorrenthalpy: 0.175129 hartree
zpe.thermalcorrgfe: 0.121787 hartree
zpe.sumelectzpe: -729.268596 hartree
zpe.sumelectthermal: -729.256583 hartree
zpe.sumelectthermalent: -729.255638 hartree
zpe.sumelectthermalfe: -729.308981 hartree
dipole: 3.0110 6.8636 0.0014
dipole: 7.4950
quadrupole: -69.7556 -94.7265 -94.2834
quadrupole: -9.1136 -0.0019 0.0093
quadrupole: 16.4996 -8.4713 -8.0282 -9.1136 -0.0019 0.0093
hfenergy: -729.4307675 hartree
pointgroup: C01 [X(C9H7N7)]
dipole: 1.261899 -2.6651175 -0.0000468 debye
dipolederiv: -0.9013226 0.263353 0.0002033 -1.1389309 -0.9602943 0.000301 -0.0004619 0.0001818 0.0803028 -1.7229128 -0.3500936 0.0000889 -0.7468635 -0.7530325 0.0001586 0.0010753 -0.0001167 -0.246909 -0.5383275 -0.2873893 0.0000574 -0.3319158 -0.0258818 0.0000362 0.0000351 0.0000183 -0.1640862 0.6722524 0.4159444 -0.0000809 0.9096174 0.3593861 -0.0000358 -0.0001317 0.0001043 -0.0951988 -0.753436 0.0330708 0.0001303 0.2305183 -1.5630408 0.0000818 -0.0002395 0.0011509 -0.2561282 -0.7116124 -0.652045 0.0003429 -0.5799271 -1.2422462 0.0004619 0.0002039 -0.0000354 -0.6944303 -0.4751916 0.3898215 -0.0003892 0.6902575 -1.0422344 0.0007469 -0.0003256 -0.0002211 -0.4666505 -0.548909 -0.1209214 0.0000192 -0.2300261 0.0344251 -0.0000683 0.0001192 0.0001671 0.0051084 0.9186 0.1074894 -0.0001687 1.0147751 0.9077464 -0.0002269 -0.0002213 -0.0002982 0.1806276 0.2566507 -0.1099772 -0.0000152 0.3535718 -0.0678984 0.0000284 -0.0002546 -0.0000119 0.1123099 -0.1174816 0.1997731 -0.0000166 -0.0022951 -0.0259016 0.0000043 0.0001032 0.0000176 -0.1106445 -0.0753859 0.1218523 -0.00002 0.219711 0.0876556 -0.0000235 0.0000151 -0.0000685 -0.107858 1.3466567 -0.2154591 0.0000044 -0.5668035 1.492116 -0.0010615 0.000721 -0.0009121 0.1151668 -0.0423564 -0.194907 0.0000455 -0.1118395 0.0950554 -0.0000282 -0.0000161 -0.0000524 -0.1292807 0.1916777 0.0012045 0.0000087 0.0410483 -0.0223035 -0.0000253 -0.0000074 0.0000044 -0.1369721 1.9580968 0.3995601 -0.0001985 0.3292964 1.8491627 -0.0002287 -0.000664 0.0006268 0.2419431 0.1008074 -0.0761214 0.0000012 -0.0197346 0.0275969 0.000012 0. 0.0000198 0.1539357 0.0847487 -0.02302 0.0000039 -0.0769928 0.0024298 0.0000199 0.0000279 0.0000023 0.1646467 0.0253209 0.0760601 -0.0000079 0.0989873 -0.0376441 0.0000272 -0.0000198 0.0000209 0.1586151 -0.1102657 -0.0027914 -0.0000008 0.0015069 0.1003705 0.0000064 -0.0000003 0.0000162 0.1583626 0.1799776 0.0062364 -0.000084 0.0913138 0.2877317 -0.0001318 -0.0002816 -0.0003285 0.380004 0.2563879 0.1002907 -0.0001 0.0440789 0.191712 -0.0001201 -0.0001207 -0.0002079 0.3902789 0.0060249 -0.0819307 0.000176 -0.2193538 0.3050896 0.0000655 0.0004438 -0.0000773 0.2668567 unknown
polarizability: 239.987674|-2.1753525|178.2494595|-0.0134955|-0.0199123|57.0251491 unknown
InChI: InChI=1S/C9H7N7/c10-8-12-7-5-3-1-2-4-6(5)14-15-16(7)9(11)13-8/h1-4,11H,10H2
charge 0 multiplicity 1
23 atoms
N  -0.928438 0.858327 -0.000556
N  -1.034985 -1.550883 0.000409
N  1.105805 2.061854 -0.000469
N  -0.195435 2.116031 -0.000515
N  -3.105478 -0.229051 0.000309
N  -3.134739 -2.566447 0.000486
N  -2.919038 2.181712 -0.000302
C  1.128993 -0.427714 -0.00024
C  -0.33416 -0.41577 -0.00029
C  1.808277 0.824333 -0.000377
C  1.874243 -1.632746 -0.000029
C  3.226114 0.875706 -0.000367
C  -2.404262 0.986142 -0.001365
C  3.279235 -1.577503 -0.000022
C  3.956067 -0.324201 -0.000198
C  -2.435355 -1.387627 0.001289
H  1.331348 -2.581998 0.000082
H  3.710589 1.856504 -0.000478
H  3.859772 -2.505849 0.000111
H  5.050497 -0.298097 -0.000187
H  -2.62601 -3.446284 -0.000004
H  -4.151057 -2.538915 0.00001
H  -3.955484 2.118474 0.000804
