program: Gaussian 09
title: 000273477
version: EM64L-G09RevD.01
frameworkgroup: C1[X(C14H9N5)]
method: RPBEPBE
basis: SDD
operation: Freq
keyword: #pfreq=noraman
keyword: PBEPBE/SDD
title: #p freq=noraman PBEPBE/SDD
converged: YES YES NO NO
title: Mulliken charges:
elementType: N N N N N C C C C C C C C C C C C C C H H H H H H H H H
charge: -0.402291 -0.140714 0.013932 -0.018649 -0.055357 0.295317 0.245571 -0.338387 0.056164 -0.338729 -0.207191 0.286357 -0.240172 -0.333737 -0.342283 -0.204010 -0.230823 -0.272974 -0.185591 0.320080 0.257791 0.244807 0.241428 0.260485 0.347256 0.259469 0.240245 0.242006
chargesum: 0.00000
title: Mulliken charges with hydrogens summed into heavy atoms:
elementType: N N N N N C C C C C C C C C C C C C C
charge: -0.055035 -0.140714 0.013932 -0.018649 -0.055357 0.295317 0.245571 -0.018306 0.056164 -0.080938 0.037616 0.286357 0.001256 -0.073252 -0.082814 0.036235 0.011183 -0.272974 -0.185591
polarizability: 3.84265637e+02 -1.77556596e+01 2.21280056e+02 9.95860711e-02 -4.08665299e-02 6.87798701e+01
1716.lowfreq: -0.0009 -0.0008 -0.0007 2.6198 6.2070 8.2198 27.2124 45.4176 59.2312
frequency: 27.1802 45.3288 59.2239 101.4487 102.3876 130.8709 159.7440 164.3872 196.0632 206.0744 247.2120 247.5826 317.2026 371.5250 388.3296 393.0528 433.6969 463.8765 503.5218 518.6727 537.8416 546.7442 569.2997 575.2777 587.7204 628.1766 654.5657 711.8347 745.5639 751.8192 761.2590 766.0348 777.5191 778.8448 830.5704 896.3579 898.5961 920.7465 970.2425 970.7488 999.8243 1010.6763 1036.0637 1040.1517 1084.6327 1104.7526 1168.9975 1173.1069 1180.7284 1189.1702 1194.2015 1220.4821 1259.7666 1276.8887 1307.9838 1348.8222 1374.5936 1386.0869 1430.2230 1446.1758 1451.9745 1465.9603 1509.6608 1560.2395 1582.6428 1604.5314 1607.0570 2162.1598 2162.6346 3142.6987 3146.3046 3153.1068 3157.1435 3167.3963 3168.5043 3179.1431 3179.9290 3364.6805
redmass: 7.5306 5.9008 6.8099 11.6128 5.0702 5.2033 6.1013 8.7516 5.0672 6.4173 7.7590 5.9032 6.3291 8.1622 4.3194 4.1839 9.4711 9.1632 3.6716 3.8611 7.9606 8.5653 4.5305 4.2539 7.5609 6.6058 6.4926 6.4048 4.0225 1.4550 2.7760 6.2556 1.2716 1.3072 5.9510 1.4512 1.3698 5.1682 1.3664 1.3813 1.3460 1.3267 2.3352 2.1880 3.0492 2.1054 2.8027 1.1019 1.1049 2.5513 2.6815 3.2283 1.9826 1.5535 1.6048 7.2654 8.5463 11.0196 2.3157 2.6121 2.0613 2.5840 2.4699 6.1599 5.2793 6.3319 6.2609 12.6311 12.6226 1.0860 1.0865 1.0907 1.0908 1.0950 1.0960 1.1007 1.1012 1.0752
irintensity: 4.5214 0.0153 2.8842 3.6343 0.0528 2.1385 0.9260 4.3316 6.3683 8.8715 1.2550 0.0335 2.5797 2.3905 0.0787 0.0265 3.2093 9.8401 16.6892 3.5001 1.0372 0.5085 0.4372 2.4102 2.5702 6.0265 17.1988 2.2309 0.0393 76.1954 39.8615 8.5500 43.5746 116.6609 1.5543 0.0991 0.5487 0.3025 0.9861 6.4873 0.2761 1.9409 12.2662 4.3653 8.0139 4.3291 173.4859 0.7081 23.8134 0.5818 17.4552 19.5613 197.5628 23.4665 25.6809 136.4557 4.4414 237.7054 35.6508 45.3890 19.1257 38.4650 230.6948 2.2962 72.1830 0.2331 35.4828 25.4619 55.6309 1.6500 1.1755 5.7989 8.3728 10.8585 0.9259 26.8588 19.2258 24.7447
temp: 298.150 k
press: 1.00000 atm
elementType: 7 7 7 7 7 6 6 6 6 6 6 6 6 6 6 6 6 6 6 1 1 1 1 1 1 1 1 1
symmnumber: 1
zpe: 526095.1 jmol-1
zpe.correction: 0.200379 hartree
zpe.thermalcorrener: 0.216116 hartree
zpe.thermalcorrenthalpy: 0.217060 hartree
zpe.thermalcorrgfe: 0.156020 hartree
zpe.sumelectzpe: -811.295395 hartree
zpe.sumelectthermal: -811.279659 hartree
zpe.sumelectthermalent: -811.278715 hartree
zpe.sumelectthermalfe: -811.339755 hartree
dipole: -2.2481 -1.0191 -0.0183
dipole: 2.4684
quadrupole: -77.3249 -120.8911 -113.3509
quadrupole: -18.1095 -0.0239 -0.0030
quadrupole: 26.5308 -17.0355 -9.4953 -18.1095 -0.0239 -0.0030
hfenergy: -811.4957744 hartree
pointgroup: C01 [X(C14H9N5)]
dipole: -0.8963445 -0.2051337 0.3123648 debye
polarizability: 382.3458218|1.3873492|99.0068345|26.5627661|-60.5884867|192.9729067 unknown
InChI: InChI=1S/C14H9N5/c15-9-11-5-1-3-7-13(11)17-19-18-14-8-4-2-6-12(14)10-16/h1-8,17H
charge 0 multiplicity 1
28 atoms
N  1.090792 0.084531 -0.824446
N  -1.078648 0.200321 -1.260332
N  -0.170974 -0.188068 -0.397348
N  3.788216 1.23232 -2.849982
N  -1.272289 -1.563146 2.295059
C  2.199583 -0.260068 -0.030287
C  3.512687 0.048858 -0.51321
C  2.040807 -0.900152 1.226484
C  -2.417692 -0.063494 -0.851993
C  4.647725 -0.289123 0.27244
C  3.18061 -1.224808 1.985168
C  -2.845392 -0.686107 0.373974
C  4.485398 -0.92369 1.517397
C  -3.401334 0.352041 -1.788209
C  -4.236831 -0.864963 0.611114
C  -4.773506 0.166321 -1.536923
C  -5.195726 -0.444571 -0.331666
C  3.675876 0.696938 -1.78433
C  -1.940431 -1.146943 1.392731
H  1.037669 -1.134371 1.593461
H  5.644505 -0.047137 -0.108651
H  3.04747 -1.718611 2.953292
H  5.361895 -1.182165 2.118934
H  -3.049079 0.82215 -2.711364
H  1.212958 0.549685 -1.740197
H  -4.552882 -1.338531 1.546237
H  -5.511623 0.495854 -2.275267
H  -6.260985 -0.591872 -0.128285
