program: Gaussian 09
title: 000273476
version: EM64L-G09RevD.01
frameworkgroup: C1[X(C13H9ClN4)]
method: RPBEPBE
basis: SDD
operation: Freq
keyword: #p
keyword: freq=noraman
keyword: PBEPBE/SDD
title: #p freq=noraman PBEPBE/SDD
converged: YES YES NO NO
title: Mulliken charges:
elementType: Cl N N N N C C C C C C C C C C C C C H H H H H H H H H
charge: -0.026857 -0.401461 -0.154136 0.011273 -0.019535 0.290221 0.246728 -0.343685 0.267402 -0.337358 -0.193419 -0.244164 -0.213635 -0.327842 -0.198699 -0.212951 -0.228314 -0.274106 0.289656 0.257150 0.236882 0.240307 0.343757 0.258809 0.257160 0.237994 0.238822
chargesum: 0.00000
title: Mulliken charges with hydrogens summed into heavy atoms:
elementType: Cl N N N N C C C C C C C C C C C C C
charge: -0.026857 -0.057704 -0.154136 0.011273 -0.019535 0.290221 0.246728 -0.054029 0.267402 -0.080208 0.043463 -0.003857 -0.213635 -0.069033 0.058461 0.025043 0.010508 -0.274106
polarizability: 3.76858384e+02 -2.06202561e+01 2.11939538e+02 2.52043439e+00 1.40389801e+00 6.63048897e+01
1716.lowfreq: -4.5785 -2.7364 0.0003 0.0009 0.0014 2.1324 9.4309 41.2280 45.6368
frequency: 9.0310 41.2182 45.6226 95.2294 100.8812 131.1898 170.5065 181.6256 188.2813 237.1507 249.3388 270.5996 328.9852 374.7573 388.1370 415.1881 456.0212 465.1458 500.2919 518.4874 548.1741 570.0976 582.3165 624.6290 638.7910 661.9706 719.3225 740.6909 743.5497 756.4121 768.6126 772.1615 820.2315 870.4159 887.5469 921.1182 953.6889 963.9386 988.0776 998.5241 1019.1661 1036.0834 1039.1550 1079.9614 1119.2550 1149.8006 1169.1852 1176.5466 1190.3177 1200.6543 1256.2061 1259.1734 1305.8433 1351.2777 1374.3655 1391.0649 1420.5835 1443.9112 1447.0185 1451.2261 1507.8370 1559.5944 1582.4824 1593.6546 1609.4225 2162.6470 3143.0692 3144.0323 3155.4124 3156.2449 3167.6924 3175.1004 3179.3525 3185.5670 3366.9605
redmass: 8.7057 5.7318 7.1576 5.3361 10.9549 5.2536 6.5370 6.4638 5.6458 7.8429 5.5403 8.9608 5.5970 9.4541 4.2436 8.0983 3.4365 8.1483 3.5895 8.2004 3.8510 4.5181 8.0359 6.6642 6.5186 6.9927 3.1086 1.3245 4.0531 6.1322 1.3138 1.2638 6.2057 1.3986 1.3985 4.9879 1.3704 1.3701 1.3337 1.3312 7.5551 2.2034 2.0616 3.2767 1.6714 2.7623 1.0635 1.0727 2.5171 3.1975 1.6244 1.7160 1.6187 8.4040 7.5377 8.8854 2.2979 2.2984 2.5248 2.2900 2.6446 6.2765 5.4212 6.4554 6.4195 12.6234 1.0857 1.0867 1.0900 1.0912 1.0948 1.0970 1.1011 1.0980 1.0752
irintensity: 1.8165 0.0851 1.0266 1.0670 4.3684 1.7555 3.0515 0.5903 6.1741 2.9767 0.6175 7.5472 0.4765 1.3105 0.0407 3.9354 5.6931 15.4763 13.7640 5.6521 0.0701 0.3798 5.1224 4.1714 22.0820 9.3479 0.5540 106.4092 10.3757 6.3088 52.1466 114.2150 2.0295 1.4467 0.4437 0.0527 3.2392 3.7154 0.2569 1.0380 30.6669 15.9206 10.1439 34.9629 25.4231 243.5519 0.2878 1.7923 19.6825 39.4399 37.5839 144.2561 35.2063 35.0557 11.6510 193.0080 25.9543 40.7896 53.9975 7.8550 293.5033 4.0635 102.3080 10.4330 67.6685 62.2866 1.6513 1.9619 5.8987 7.0793 8.1862 12.9790 22.9800 8.1659 14.1747
temp: 298.150 k
press: 1.00000 atm
elementType: 17 7 7 7 7 6 6 6 6 6 6 6 6 6 6 6 6 6 1 1 1 1 1 1 1 1 1
symmnumber: 1
zpe: 504033.5 jmol-1
zpe.correction: 0.191976 hartree
zpe.thermalcorrener: 0.207359 hartree
zpe.thermalcorrenthalpy: 0.208303 hartree
zpe.thermalcorrgfe: 0.146499 hartree
zpe.sumelectzpe: -1178.550898 hartree
zpe.sumelectthermal: -1178.535515 hartree
zpe.sumelectthermalent: -1178.534571 hartree
zpe.sumelectthermalfe: -1178.596375 hartree
dipole: -1.5811 -2.7601 -0.3725
dipole: 3.2026
quadrupole: -85.2777 -114.7684 -115.6106
quadrupole: -18.4445 -0.2357 -0.5884
quadrupole: 19.9412 -9.5495 -10.3917 -18.4445 -0.2357 -0.5884
hfenergy: -1178.7428741 hartree
pointgroup: C01 [X(C13H9Cl1N4)]
dipole: 0.6046392 -0.8118226 0.7503107 debye
polarizability: 377.4964276|10.4085824|159.3288621|-15.1860249|-69.4523774|118.2775217 unknown
InChI: InChI=1S/C13H9ClN4/c14-11-6-2-4-8-13(11)17-18-16-12-7-3-1-5-10(12)9-15/h1-8,16H
charge 0 multiplicity 1
27 atoms
Cl 2.03394 -2.294583 0.961032
N  -0.964713 0.277802 -0.574081
N  1.216613 0.484492 -0.799612
N  0.267862 -0.197092 -0.207426
N  -3.509108 2.251976 -2.123855
C  -2.130417 -0.303883 -0.056048
C  -3.404738 0.220996 -0.450496
C  -2.073803 -1.398793 0.846611
C  2.560597 0.101852 -0.52802
C  -4.596113 -0.358661 0.064985
C  -3.265794 -1.955144 1.344123
C  -4.531413 -1.442264 0.959132
C  3.083961 -1.017899 0.189803
C  3.507716 1.002156 -1.104993
C  4.473124 -1.21278 0.32523
C  4.893657 0.817209 -0.969359
C  5.382728 -0.297144 -0.248158
C  -3.472719 1.328041 -1.362361
H  -1.096395 -1.790149 1.13816
H  -5.560441 0.054193 -0.246743
H  -3.209837 -2.799407 2.039537
H  -5.451276 -1.884543 1.352875
H  -1.006573 1.070791 -1.236506
H  3.094973 1.850586 -1.659957
H  4.837048 -2.083451 0.878909
H  5.587508 1.531906 -1.422847
H  6.458916 -0.461105 -0.132833
