program: Gaussian 09
title: 000273451
version: EM64L-G09RevD.01
frameworkgroup: C1[X(C8H12O4S2)]
method: RPBEPBE
basis: SDD
operation: Freq
keyword: #p
keyword: freq=noraman
keyword: PBEPBE/SDD
title: #p freq=noraman PBEPBE/SDD
converged: YES YES NO NO
title: Mulliken charges:
elementType: S S O O O O C C C C C C C C H H H H H H H H H H H H
charge: 0.246624 0.264125 -0.256635 -0.427603 -0.230171 -0.220052 -0.548411 -0.441485 -0.388013 -0.619965 -0.628936 0.262235 0.208688 -0.507488 0.244306 0.302888 0.277321 0.247316 0.267682 0.278773 0.267469 0.293541 0.388873 0.228418 0.247160 0.243340
chargesum: 0.00000
title: Mulliken charges with hydrogens summed into heavy atoms:
elementType: S S O O O O C C C C C C C C
charge: 0.246624 0.264125 -0.256635 -0.038730 -0.230171 -0.220052 -0.548411 0.105709 0.136624 -0.073511 -0.067925 0.262235 0.208688 0.211430
polarizability: 1.37327048e+02 1.13035568e+01 1.35473183e+02 5.55018035e-01 -9.75931476e-01 1.12442677e+02
1716.lowfreq: -10.8363 -0.0024 -0.0008 0.0007 4.5750 13.4344 25.6998 36.8103 50.2911
frequency: 25.0350 36.7514 50.2847 65.9046 72.4998 90.2269 115.8303 135.8059 181.9531 191.7537 234.6251 249.6217 270.2477 285.9531 327.5304 356.9821 391.1616 437.1622 461.5728 478.3357 548.8623 581.7908 605.4803 628.2585 636.7050 646.0985 679.8419 727.9553 785.4917 832.0894 856.5223 893.0358 948.6258 958.8989 983.7753 1006.1976 1009.1966 1062.5914 1105.7515 1109.3329 1111.1547 1146.0673 1147.8337 1158.4512 1220.4032 1251.0043 1265.8527 1288.9524 1301.9384 1315.7432 1341.1034 1420.2549 1426.6129 1432.6799 1438.2867 1442.2808 1451.5413 1464.3990 1640.6728 1665.7789 2985.8312 3003.5415 3009.5258 3024.3102 3035.1929 3095.3967 3101.5023 3106.3893 3108.2272 3124.5605 3145.5971 3514.1163
redmass: 9.8080 5.9958 5.6601 4.3799 4.3174 4.1827 1.1315 7.0425 5.1689 4.6950 5.8142 2.2703 4.5498 3.6996 4.0343 4.8242 6.5624 3.2747 2.8214 3.8060 4.4516 2.6109 3.8008 5.3918 2.7773 2.5886 3.7086 5.6366 4.7542 5.2990 1.5951 2.3902 1.5210 3.2891 3.6483 2.3038 3.6225 2.8144 1.0774 2.2141 1.3701 1.4508 1.4320 1.9262 1.3952 1.3551 1.6674 1.2049 1.7814 1.3932 1.3835 1.1749 1.0964 1.0833 1.0905 1.0814 1.0502 1.0507 9.1114 8.7698 1.0674 1.0293 1.0620 1.0560 1.0597 1.0984 1.1072 1.1044 1.0930 1.1061 1.1051 1.0640
irintensity: 1.7626 1.8260 0.5889 1.5019 2.0972 2.6232 0.0732 0.6760 3.4061 1.0132 0.3019 1.7003 5.9123 10.9368 0.7275 4.3115 2.4556 0.8814 15.7444 5.7618 47.8241 56.4360 5.3745 1.8194 51.2921 40.6693 25.7817 5.4944 9.4544 23.7770 13.2001 2.8356 4.1161 29.3357 29.9914 4.9789 22.3431 55.6822 22.1991 117.5477 24.6403 31.7777 5.1141 113.6248 21.3742 7.4185 67.0961 19.6107 22.6620 7.4926 23.1702 24.5629 8.8440 13.3352 4.3270 18.4282 13.2783 10.1229 187.6001 268.7913 9.3151 31.1237 6.1351 12.2997 34.8498 3.7481 2.1718 23.3497 1.5314 13.5858 13.9899 30.5047
temp: 298.150 k
press: 1.00000 atm
elementType: 16 16 8 8 8 8 6 6 6 6 6 6 6 6 1 1 1 1 1 1 1 1 1 1 1 1
symmnumber: 1
zpe: 509913.9 jmol-1
zpe.correction: 0.194216 hartree
zpe.thermalcorrener: 0.210164 hartree
zpe.thermalcorrenthalpy: 0.211109 hartree
zpe.thermalcorrgfe: 0.148770 hartree
zpe.sumelectzpe: -1407.973064 hartree
zpe.sumelectthermal: -1407.957115 hartree
zpe.sumelectthermalent: -1407.956171 hartree
zpe.sumelectthermalfe: -1408.018510 hartree
dipole: 2.3853 1.8282 -0.3356
dipole: 3.0240
quadrupole: -96.4071 -94.7368 -96.6168
quadrupole: 10.6055 4.4453 6.5524
quadrupole: -0.4868 1.1834 -0.6966 10.6055 4.4453 6.5524
hfenergy: -1408.1672799 hartree
pointgroup: C01 [X(C8H12O4S2)]
dipole: 0.9623247 0.6105778 -0.3414842 debye
dipolederiv: -0.2442348 -0.0353544 0.0400345 -0.0187182 -0.2626035 -0.0674741 -0.0353916 -0.1220773 -0.179334 -0.2408099 -0.0875312 0.0284979 -0.0752975 -0.2941698 -0.0521424 0.0675037 0.0084349 -0.1478882 -1.2068185 -0.1428334 0.0564761 -0.2754064 -0.5195439 0.1430407 0.1094742 0.1472699 -0.3937009 -0.4593453 0.0450884 -0.0920343 0.1202856 -1.0366883 0.2218779 -0.1072981 0.2914384 -0.4154636 -0.577018 0.1609428 -0.1119233 -0.098902 -0.6766393 0.2323064 0.0422386 0.3921923 -0.5522024 -0.9840615 0.2263923 0.0675408 0.1689259 -0.5659809 0.0868911 0.3307862 0.0281513 -0.3997683 0.4280374 0.1098305 -0.0908465 0.0022045 0.4883983 0.0453183 -0.0124251 0.0823039 0.2427088 -0.2771926 -0.0165394 -0.0580012 0.0516992 -0.1376366 0.0962163 -0.1069611 0.0189812 -0.1032355 -0.2364261 -0.0123444 0.1310816 -0.0015061 -0.1027228 0.0691013 0.1853608 0.1142445 -0.1012267 0.0481776 0.0128077 -0.034903 0.0469615 0.2538788 -0.0395085 0.0109034 -0.1174416 -0.0011668 0.1133341 0.0560395 0.0815805 -0.0069583 0.074813 0.0917757 0.1470261 0.1196025 0.0827382 1.2874453 -0.0282103 0.0509592 0.3641642 0.8601193 -0.4248961 -0.1358816 -0.5791954 0.6661274 1.2300695 -0.2807277 -0.209596 -0.3076527 1.2055076 -0.3533691 -0.4857478 -0.4095197 0.5650597 0.5952882 -0.0156475 0.0297014 -0.0026348 0.2349539 0.0173466 0.0998022 0.0223308 0.2375407 0.0690707 0.0440486 0.0080232 0.0192437 0.0685796 -0.0267217 0.0031152 -0.0635147 -0.0445096 0.1334285 0.0042531 -0.0296248 -0.0465467 0.0218843 0.0365735 -0.0136853 0.0619407 0.0891279 0.0528439 0.0395244 0.0121402 0.0463422 -0.0147719 0.0371238 0.0100526 0.0038199 0.0895982 0.061973 -0.0348691 -0.0038676 -0.052958 0.0476054 -0.0880721 -0.0290225 -0.0858905 -0.0212756 0.0740397 -0.0526699 -0.0506342 -0.045053 0.0228486 -0.0596563 -0.059952 -0.0819654 -0.0371178 -0.0267036 0.0692091 0.0060479 0.0514139 -0.0681376 0.0250257 -0.0275785 0.1085897 0.0643985 0.0639331 -0.0670787 0.0224656 -0.0655025 -0.0609651 0.0607743 0.0262973 0.0764611 0.0397535 -0.0780698 0.0137657 -0.0451317 0.0398398 0.0859699 -0.0303077 -0.1160369 -0.0347313 -0.0021646 0.1723508 0.0136812 0.1196464 0.076554 0.3584932 -0.0058814 0.1314806 0.03418 0.2677303 -0.0074692 -0.0584392 0.0349496 -0.1191826 0.0303599 0.0652919 0.0684477 0.0721548 0.0483877 -0.0044711 0.0238773 -0.0098089 0.123695 -0.0862395 -0.0220451 -0.0463572 -0.0201611 0.0916148 0.0126286 0.0127851 0.0472265 0.0049892 0.0726875 -0.0585889 -0.0561509 -0.0675991 -0.0857318 unknown
polarizability: 138.2568482|10.6455022|132.2231233|-3.3350062|-6.9202181|114.7629364 unknown
InChI: InChI=1S/C8H12O4S2/c1-12-7(11)5-8(4-6(9)10)13-2-3-14-8/h9H,2-5H2,1H3
charge 0 multiplicity 1
26 atoms
S  -0.211064 0.901521 1.17265
S  0.443195 1.343839 -1.841828
O  2.531471 -0.6857 -0.388056
O  -2.570924 -1.593667 0.56046
O  1.664835 -2.294293 1.046313
O  -3.978949 0.235077 0.356609
C  -0.423142 0.158007 -0.59048
C  0.184822 -1.270701 -0.633552
C  -1.926575 0.16666 -1.002923
C  0.383375 2.607166 0.615217
C  1.333509 2.406825 -0.566474
C  1.495367 -1.475181 0.115576
C  -2.924995 -0.345881 0.025617
C  3.836066 -0.847213 0.301929
H  0.33498 -1.54707 -1.694315
H  -0.53542 -1.973611 -0.184869
H  -2.231066 1.198508 -1.234679
H  -2.048476 -0.431849 -1.929677
H  0.896943 3.04752 1.487963
H  -0.486576 3.224454 0.340942
H  1.56531 3.361934 -1.069632
H  2.258504 1.890987 -0.268435
H  -3.245831 -1.865438 1.240029
H  4.522377 -0.178568 -0.236791
H  4.173514 -1.895298 0.242337
H  3.741951 -0.558531 1.362571
