program: Gaussian 09
title: 000273448
version: EM64L-G09RevD.01
frameworkgroup: C1[X(C8H13NO3S2)]
method: RPBEPBE
basis: SDD
operation: Freq
keyword: #p
keyword: freq=noraman
keyword: PBEPBE/SDD
title: #p freq=noraman PBEPBE/SDD
converged: YES YES NO NO
title: Mulliken charges:
elementType: S S O O O N C C C C C C C C H H H H H H H H H H H H H
charge: 0.245229 0.272387 -0.266082 -0.272655 -0.257289 -0.620525 -0.569175 -0.490163 -0.439941 -0.625671 -0.629484 0.278393 0.277917 -0.506115 0.259739 0.308257 0.267465 0.319897 0.272379 0.266545 0.271783 0.263788 0.321084 0.334760 0.233638 0.240924 0.242914
chargesum: 0.00000
title: Mulliken charges with hydrogens summed into heavy atoms:
elementType: S S O O O N C C C C C C C C
charge: 0.245229 0.272387 -0.266082 -0.272655 -0.257289 0.035319 -0.569175 0.077833 0.147421 -0.086747 -0.093913 0.278393 0.277917 0.211362
polarizability: 1.41218372e+02 -6.22270933e+00 1.44808524e+02 -3.53461603e+00 2.68617104e+00 1.17005380e+02
1716.lowfreq: -15.7793 -14.2574 -8.0286 -0.0029 -0.0020 -0.0016 17.7392 25.9733 45.8842
frequency: 15.4807 25.7470 45.8607 57.1619 80.4440 101.2765 109.2309 156.8370 166.5632 218.7930 242.0673 258.0632 266.0634 283.7294 307.1609 338.3710 388.7167 437.0185 475.0307 481.3624 520.9469 534.3145 570.7645 607.3069 624.4229 636.4804 641.9511 700.8909 710.3014 828.7121 848.0329 855.8437 905.0230 948.0954 952.2896 972.3295 1009.0373 1022.5331 1058.7412 1103.2583 1112.3869 1116.3760 1144.9373 1148.6414 1174.4850 1232.3006 1251.1122 1254.6237 1285.4866 1291.7689 1328.5991 1365.9334 1420.6886 1422.2806 1423.7961 1433.7271 1441.5851 1452.7391 1463.9593 1593.4047 1631.9357 1642.2178 2980.0297 2982.9172 3004.7094 3020.9012 3028.9713 3059.6144 3090.6038 3092.5614 3106.6791 3110.5207 3149.1090 3518.1397 3673.7919
redmass: 4.6793 4.3908 4.6322 6.5405 5.6674 1.1250 6.6559 4.3483 4.0170 8.0390 2.1314 6.8202 4.4616 2.7384 3.1808 5.0191 8.6696 3.5724 3.2035 1.5125 1.2854 3.7244 3.6230 2.9830 5.8882 3.6479 2.1527 4.2460 5.3058 3.8375 4.7066 1.6014 3.4178 2.6634 1.4761 4.3494 2.2530 2.3508 1.9863 1.0490 1.3083 2.9835 1.4415 1.4466 3.2258 1.2972 1.2277 1.2822 1.5706 1.2367 1.6597 2.8584 1.1618 1.1145 1.0854 1.0817 1.1000 1.0501 1.0506 1.5741 4.8601 3.8973 1.0669 1.0617 1.0295 1.0550 1.0592 1.0974 1.0923 1.1072 1.1046 1.1082 1.1048 1.0446 1.1045
irintensity: 4.5423 7.9722 1.9468 3.3741 2.5390 0.0223 1.1032 9.1574 6.3421 6.2386 1.4860 2.9546 17.9738 9.5118 5.0837 13.5416 3.3854 0.2210 8.0982 9.0002 193.2151 17.9505 1.1048 65.8812 6.4341 7.8913 23.1173 2.2022 4.2009 2.0213 11.4362 8.2447 3.6337 37.0913 2.7989 38.7769 5.6316 30.6701 8.1553 0.7858 11.1399 193.9116 5.3098 12.8494 101.8509 17.1982 0.4823 10.5697 41.1310 9.7442 140.9157 176.9779 57.1482 14.8204 23.2270 26.8871 3.8151 14.1142 11.9117 49.5456 3.2197 415.9861 29.2836 32.8611 33.1092 15.8796 40.7554 2.4098 1.5113 0.2279 25.0108 21.0224 16.7199 40.9666 27.0607
temp: 298.150 k
press: 1.00000 atm
elementType: 16 16 8 8 8 7 6 6 6 6 6 6 6 6 1 1 1 1 1 1 1 1 1 1 1 1 1
symmnumber: 1
zpe: 544048.4 jmol-1
zpe.correction: 0.207217 hartree
zpe.thermalcorrener: 0.223390 hartree
zpe.thermalcorrenthalpy: 0.224335 hartree
zpe.thermalcorrgfe: 0.160857 hartree
zpe.sumelectzpe: -1388.117706 hartree
zpe.sumelectthermal: -1388.101532 hartree
zpe.sumelectthermalent: -1388.100588 hartree
zpe.sumelectthermalfe: -1388.164066 hartree
dipole: 0.6510 -0.6886 2.1575
dipole: 2.3565
quadrupole: -84.6777 -80.8837 -103.5704
quadrupole: 0.5879 6.9020 11.0958
quadrupole: 5.0329 8.8269 -13.8598 0.5879 6.9020 11.0958
hfenergy: -1388.3249226 hartree
pointgroup: C01 [X(C8H13N1O3S2)]
dipole: 0.2297578 0.2541284 -0.8614816 debye
polarizability: 138.4736398|5.0208724|147.6271574|3.461326|1.2612054|116.9314781 unknown
InChI: InChI=1S/C8H13NO3S2/c1-12-7(11)5-8(4-6(9)10)13-2-3-14-8/h2-5,9H2,1H3
charge 0 multiplicity 1
27 atoms
S  0.487999 1.86385 -1.451073
S  2.136727 1.134069 1.085446
O  -2.937189 0.433956 0.672441
O  1.214782 -1.945015 1.381147
O  -1.86233 -0.719394 -1.033457
N  2.110449 -2.999368 -0.472305
C  0.72258 0.529755 -0.09151
C  1.158705 -0.764255 -0.806754
C  -0.553469 0.404811 0.770167
C  1.167978 3.280703 -0.406564
C  2.468993 2.792495 0.230934
C  1.48786 -1.927395 0.142656
C  -1.797162 -0.027874 0.011604
C  -4.23355 0.027483 0.076519
H  2.040254 -0.539877 -1.433521
H  0.331283 -1.087985 -1.469843
H  -0.765704 1.358934 1.278012
H  -0.351639 -0.350664 1.557605
H  0.421862 3.569809 0.351559
H  1.335731 4.121995 -1.101359
H  3.257694 2.657701 -0.526077
H  2.817913 3.479479 1.021968
H  2.336922 -2.998496 -1.465259
H  2.335063 -3.819152 0.091191
H  -4.994142 0.469394 0.735067
H  -4.315743 -1.072231 0.05386
H  -4.318866 0.418168 -0.951256
