program: Gaussian 09
title: 000273446
version: EM64L-G09RevD.01
frameworkgroup: C1[X(C11H17NO4)]
method: RPBEPBE
basis: SDD
operation: Freq
keyword: #p
keyword: freq=noraman
keyword: PBEPBE/SDD
title: #p freq=noraman PBEPBE/SDD
converged: YES YES NO NO
title: Mulliken charges:
elementType: O O O O N C C C C C C C C C C C H H H H H H H H H H H H H H H H H
charge: -0.281687 -0.243768 -0.256230 -0.232227 -0.443529 0.276994 -0.699132 -0.702796 -0.099539 0.214589 -0.629007 0.281557 -0.612937 -0.592412 0.271783 -0.502171 0.356038 0.269173 0.222182 0.206242 0.265747 0.222314 0.203959 0.209967 0.299278 0.257379 0.290348 0.270171 0.213435 0.229755 0.240503 0.247194 0.246825
chargesum: 0.00000
title: Mulliken charges with hydrogens summed into heavy atoms:
elementType: O O O O N C C C C C C C C C C C
charge: -0.281687 -0.243768 -0.256230 -0.232227 -0.087491 0.276994 -0.001536 -0.010776 0.110428 0.214589 -0.072349 0.281557 -0.052418 -0.149222 0.271783 0.232352
polarizability: 1.77276935e+02 5.97268827e-01 1.39578735e+02 -4.79341626e+00 -1.86660072e-01 1.00790175e+02
1716.lowfreq: -5.3091 0.0007 0.0007 0.0011 2.8666 7.3354 15.0344 23.2557 27.8162
frequency: 14.9831 23.2271 27.6911 50.7966 71.3489 88.4315 92.1378 110.1932 117.1381 137.9838 165.2590 194.6035 219.3781 229.2859 256.5108 265.0411 304.5354 308.4051 332.5589 373.2865 375.2890 412.3283 424.8000 458.8562 524.5401 534.1457 577.4139 595.8741 658.4758 668.4112 696.6108 727.3769 781.1649 814.4927 860.2594 863.7887 891.5072 925.8704 935.7084 948.7696 952.7861 972.6834 992.4139 998.7197 1014.8143 1054.6962 1106.6665 1113.9988 1140.8784 1149.0737 1158.7056 1165.7888 1187.0061 1198.0891 1239.0740 1267.7474 1303.3056 1310.0767 1319.3613 1368.9956 1386.7883 1411.6164 1417.7236 1423.6736 1444.0373 1453.9772 1454.7685 1462.6188 1472.3506 1475.8904 1492.8443 1526.6116 1600.7325 1634.4367 1643.8726 1658.7294 2984.9100 2986.4784 2989.8396 3005.4059 3010.1219 3072.7022 3076.6321 3084.6092 3086.9066 3091.2575 3101.8584 3103.3655 3108.2396 3114.5027 3157.3661 3191.9627 3408.2852
redmass: 4.6915 3.7339 4.6483 4.4873 3.0910 1.4988 2.0497 4.1896 4.1272 3.3484 3.5729 4.3043 1.0444 3.6056 1.1317 3.4279 2.2670 2.7893 2.7397 3.9694 4.4220 3.1315 2.8751 3.2005 3.0553 2.9200 3.9903 4.6238 3.2941 2.0796 4.4923 1.1893 3.1436 3.8459 2.6762 4.2125 2.3331 1.5596 1.3480 3.4417 2.5266 3.3788 2.2486 1.1615 1.2944 1.4408 1.5782 1.2673 3.1574 1.4424 3.5686 1.7044 1.7191 1.6751 2.4071 3.4137 1.8272 1.3295 1.8892 1.1836 1.2021 1.0906 1.1060 1.1600 1.2214 1.0496 1.0462 1.0506 1.0858 1.0626 1.0558 1.7415 7.6674 5.4638 8.7977 4.2824 1.0665 1.0345 1.0349 1.0602 1.0300 1.0968 1.0934 1.0999 1.0792 1.0842 1.0923 1.0991 1.1010 1.1050 1.1052 1.1133 1.0790
irintensity: 1.3620 0.8622 1.1944 1.1666 4.9860 0.7535 3.7875 1.7803 7.4014 0.4389 10.5434 12.9160 0.0738 8.8776 0.2434 0.7245 9.2031 12.3470 0.5820 0.2325 1.9598 11.2586 2.5788 4.4963 8.4743 5.0002 8.8428 10.8012 10.5072 40.6588 9.7341 35.2906 0.4100 7.3240 8.2714 2.9547 2.0038 0.6521 81.2611 3.1976 37.5208 13.2990 4.9703 12.0759 8.3099 18.2075 235.4107 0.2278 136.3601 7.0051 23.6278 52.5168 15.4164 20.1386 61.8729 79.1124 121.9467 32.8593 68.4202 23.6557 27.1600 67.4514 33.8180 17.8209 27.6795 16.0113 0.3854 13.3199 25.9789 10.1353 18.5157 377.6636 15.9947 256.1911 174.3467 8.1627 2.8751 27.7554 26.7945 1.0555 26.6508 10.5882 4.0522 14.7985 2.2931 50.2150 11.5853 14.3275 12.1095 22.1606 13.3890 27.3707 117.7301
temp: 298.150 k
press: 1.00000 atm
elementType: 8 8 8 8 7 6 6 6 6 6 6 6 6 6 6 6 1 1 1 1 1 1 1 1 1 1 1 1 1 1 1 1 1
symmnumber: 1
zpe: 697473.6 jmol-1
zpe.correction: 0.265654 hartree
zpe.thermalcorrener: 0.284510 hartree
zpe.thermalcorrenthalpy: 0.285455 hartree
zpe.thermalcorrgfe: 0.215663 hartree
zpe.sumelectzpe: -783.759177 hartree
zpe.sumelectthermal: -783.740320 hartree
zpe.sumelectthermalent: -783.739376 hartree
zpe.sumelectthermalfe: -783.809168 hartree
dipole: -3.0915 1.4818 0.8258
dipole: 3.5263
quadrupole: -66.1719 -105.7919 -99.2292
quadrupole: 5.0515 -3.9552 1.1900
quadrupole: 24.2257 -15.3942 -8.8315 5.0515 -3.9552 1.1900
hfenergy: -784.0248306 hartree
pointgroup: C01 [X(C11H17N1O4)]
dipole: 1.2346169 -0.0395252 -0.631587 debye
polarizability: 177.0645115|6.2651554|102.2148346|0.7089964|-6.7163919|138.3664987 unknown
InChI: InChI=1S/C11H17NO4/c1-5-11(2,3)12-9(14)6-8(13)7-10(15)16-4/h5,12H,1,6-7H2,2-4H3
charge 0 multiplicity 1
33 atoms
O  -1.231439 -0.696855 2.198577
O  0.15548 0.532487 -1.684285
O  4.644369 0.350937 -0.243538
O  3.066687 1.919599 0.447468
N  -1.931193 0.047977 0.084318
C  -3.37975 -0.266547 0.199487
C  -3.583336 -1.785194 0.491542
C  -4.007085 0.582398 1.344914
C  -4.087071 0.067396 -1.111552
C  -0.997275 -0.180451 1.060121
C  0.44675 0.287803 0.738615
C  0.921773 0.29493 -0.705905
C  2.397674 -0.014702 -0.962799
C  -3.549555 0.404446 -2.309901
C  3.355367 0.869706 -0.168242
C  5.70046 1.142352 0.442548
H  -1.573846 0.445445 -0.795062
H  -3.10841 -2.046639 1.451356
H  -3.137196 -2.394205 -0.313813
H  -4.662161 -2.017456 0.548583
H  -3.505873 0.348518 2.298838
H  -3.897524 1.660348 1.132723
H  -5.083359 0.35174 1.444592
H  -5.181622 -0.006105 -1.026428
H  0.550559 1.330458 1.107452
H  1.122459 -0.311717 1.371902
H  2.606035 0.11025 -2.040479
H  2.608196 -1.072216 -0.711482
H  -4.197575 0.605448 -3.170059
H  -2.472696 0.489651 -2.50024
H  6.628012 0.58285 0.261401
H  5.479359 1.213162 1.52032
H  5.753584 2.156283 0.012829
