program: Gaussian 09
title: 000273443
version: EM64L-G09RevD.01
frameworkgroup: C1[X(C12H18N2O5)]
method: RPBEPBE
basis: SDD
operation: Freq
keyword: #p
keyword: freq=noraman
keyword: PBEPBE/SDD
title: #p freq=noraman PBEPBE/SDD
converged: YES YES NO NO
title: Mulliken charges:
elementType: O O O O O N N C C C C C C C C C C C C H H H H H H H H H H H H H H H H H H
charge: -0.284624 -0.330344 -0.279339 -0.254334 -0.263131 -0.460923 -0.003376 0.393321 -0.592744 -0.556900 -0.300893 -0.357417 0.232024 0.317715 0.296182 -0.679324 -0.679384 -0.250311 -0.504389 0.260877 0.248573 0.259002 0.257530 0.241593 0.223901 0.246092 0.272474 0.380829 0.218268 0.222320 0.279341 0.225729 0.221381 0.273373 0.243347 0.237562 0.246000
chargesum: 0.00000
title: Mulliken charges with hydrogens summed into heavy atoms:
elementType: O O O O O N N C C C C C C C C C C C C
charge: -0.284624 -0.330344 -0.279339 -0.254334 -0.263131 -0.080094 -0.003376 0.393321 -0.083293 -0.040369 0.164601 0.161149 0.232024 0.317715 0.296182 0.040604 0.041099 -0.250311 0.222520
polarizability: 1.76699892e+02 -9.10417275e+00 1.59384185e+02 2.56694016e+00 -8.88372361e-01 1.20266624e+02
1716.lowfreq: -5.7366 -3.7288 -0.0006 -0.0002 0.0007 8.1349 13.8451 27.7239 37.5621
frequency: 12.6126 27.5313 37.5562 44.8510 69.2541 84.7720 94.3733 107.2996 122.7368 140.5577 164.3545 185.9890 193.5994 195.7309 206.6248 220.3345 227.5282 258.4936 261.2936 298.6409 326.9466 359.3247 363.7519 371.9387 391.4568 405.0555 519.5779 538.3541 560.8560 579.3344 598.9309 638.2313 650.5162 665.5047 712.2225 739.7818 749.6926 759.7384 774.2654 827.3735 854.6963 857.9841 904.5196 914.9359 929.5952 948.1792 960.4727 967.6791 988.9077 993.5914 1014.5298 1017.6550 1057.7875 1099.9807 1111.6136 1117.6958 1150.4510 1154.7650 1174.8461 1182.1965 1188.5304 1209.7896 1212.6901 1221.9570 1248.7081 1282.1028 1315.7820 1329.6199 1332.8329 1340.8297 1370.9471 1389.9604 1420.6504 1428.2280 1446.2052 1452.4423 1453.0339 1462.0109 1466.8824 1472.4625 1473.8262 1478.9577 1492.1036 1516.7287 1620.0973 1639.2139 2187.9712 3000.0200 3002.4628 3005.0251 3008.0253 3014.8496 3033.1929 3035.5075 3091.4154 3093.7987 3101.7702 3105.1177 3107.1169 3111.8065 3118.5601 3122.3983 3123.8234 3154.6863 3356.8598
redmass: 4.3661 5.6530 3.5889 6.4043 6.4398 3.9197 1.2339 2.7228 5.0892 4.1258 4.4571 2.9266 3.9892 2.8173 4.6681 1.2784 2.9129 1.4726 2.0102 2.8148 5.0603 4.0959 3.5353 3.8096 2.7325 3.7127 5.0254 6.0244 5.5048 4.7762 4.6629 2.9444 4.3460 5.2826 4.8900 4.1408 1.3261 3.7471 3.2038 4.6637 1.8131 3.1730 3.0059 2.8973 1.6204 3.9140 3.8540 3.1299 3.7199 3.5454 1.2897 2.5149 3.9032 1.8665 1.2762 1.7720 1.4430 3.4319 1.2483 1.7293 2.7135 1.9279 1.3221 2.3872 1.3595 2.6513 1.6094 1.3071 1.2551 1.5295 1.1746 1.1900 1.1924 1.0793 1.0922 1.0463 1.0503 1.0501 1.1161 1.0859 1.0490 1.1042 1.0513 1.6008 5.6354 8.5856 12.6379 1.0341 1.0346 1.0652 1.0294 1.0605 1.0599 1.0602 1.0960 1.1057 1.1015 1.1022 1.1010 1.1047 1.1018 1.1012 1.1100 1.1050 1.0814
irintensity: 0.1411 0.5213 2.3568 3.6875 3.5202 10.0217 0.2639 3.6881 3.3018 1.0619 17.6618 0.5541 0.9057 10.0993 2.5639 1.6056 7.7160 5.4302 3.2738 6.2724 0.6900 7.1657 21.4138 6.4557 1.3602 2.1215 27.4581 0.9341 3.0048 8.0231 30.9963 2.8095 1.8595 7.1742 20.0232 6.5786 105.9442 9.2086 10.5026 4.6665 0.1821 1.1545 34.7196 22.6483 0.0864 26.6640 13.9605 23.2679 21.8563 21.1786 1.4741 9.6368 98.7724 33.1990 0.9277 74.0399 4.6228 19.3819 15.2693 66.4084 17.8375 130.1506 49.7370 57.9707 13.4355 74.9930 41.2751 4.3876 13.8453 72.8817 22.3221 31.7893 23.8664 17.1962 20.1213 1.5361 15.6606 14.5313 84.2914 6.4791 2.7316 24.4628 17.4646 214.7748 213.2365 178.8869 5.1377 20.0207 15.5654 7.2130 28.7513 46.5434 3.2982 25.7990 2.4010 17.9002 13.9686 3.0817 38.2149 23.4009 3.1705 4.9203 15.3397 14.1990 283.2607
temp: 298.150 k
press: 1.00000 atm
elementType: 8 8 8 8 8 7 7 6 6 6 6 6 6 6 6 6 6 6 6 1 1 1 1 1 1 1 1 1 1 1 1 1 1 1 1 1 1
symmnumber: 1
zpe: 771173.1 jmol-1
zpe.correction: 0.293724 hartree
zpe.thermalcorrener: 0.314617 hartree
zpe.thermalcorrenthalpy: 0.315561 hartree
zpe.thermalcorrgfe: 0.241904 hartree
zpe.sumelectzpe: -952.200852 hartree
zpe.sumelectthermal: -952.179959 hartree
zpe.sumelectthermalent: -952.179015 hartree
zpe.sumelectthermalfe: -952.252672 hartree
dipole: 3.4352 -0.0356 -0.0469
dipole: 3.4357
quadrupole: -103.8492 -128.1213 -108.2148
quadrupole: 2.9752 0.3075 7.0824
quadrupole: 9.5459 -14.7262 5.1803 2.9752 0.3075 7.0824
hfenergy: -952.4945762 hartree
pointgroup: C01 [X(C12H18N2O5)]
dipole: -1.3494596 0.0504557 0.0593563 debye
polarizability: 177.28909|7.9955838|152.8493867|-3.3256003|-14.087225|126.2122239 unknown
InChI: InChI=1S/C12H18N2O5/c1-11(2,8-13)14-9(15)6-12(7-10(16)17-3)18-4-5-19-12/h14H,4-7H2,1-3H3
charge 0 multiplicity 1
37 atoms
O  -1.180505 -0.316357 -0.930731
O  -0.25623 1.295447 0.516708
O  1.680769 -2.581854 0.551764
O  -4.380349 -0.789781 0.321488
O  -3.768777 1.306187 -0.478058
N  1.979163 -0.283622 0.214838
N  4.058443 2.157467 -0.982075
C  -0.993838 0.01035 0.499441
C  -0.147405 -1.081688 1.176981
C  -2.377807 0.159332 1.223779
C  -0.877577 0.896436 -1.741338
C  -0.697307 2.028089 -0.704841
C  1.248361 -1.388726 0.598493
C  3.359137 -0.352268 -0.345575
C  -3.545915 0.321038 0.265196
C  3.397833 -1.210562 -1.646819
C  4.36044 -0.907502 0.711338
C  3.739705 1.04553 -0.690008
C  -5.546857 -0.768961 -0.597131
H  -0.708823 -2.0292 1.125042
H  -0.035989 -0.825025 2.248767
H  -2.321009 1.049776 1.874243
H  -2.565664 -0.724116 1.854075
H  -1.728195 1.08246 -2.416279
H  0.044396 0.698697 -2.316831
H  0.101823 2.743235 -0.951203
H  -1.649682 2.544839 -0.499756
H  1.497582 0.625279 0.306535
H  2.707094 -0.802804 -2.404313
H  4.41939 -1.220988 -2.063683
H  3.092143 -2.238746 -1.397764
H  4.353962 -0.28295 1.620239
H  5.383009 -0.925384 0.297061
H  4.054945 -1.933177 0.973029
H  -6.169681 0.120103 -0.403287
H  -6.09274 -1.696291 -0.376461
H  -5.199244 -0.750765 -1.643363
