program: Gaussian 09
title: 000273435
version: EM64L-G09RevD.01
frameworkgroup: C1[X(C20H22O7)]
method: RPBEPBE
basis: SDD
operation: Freq
keyword: #pfreq=noraman
keyword: PBEPBE/SDD
title: #p freq=noraman PBEPBE/SDD
converged: YES YES NO NO
title: Mulliken charges:
elementType: O O O O O O O C C C C C C C C C C C C C C C C C C C C H H H H H H H H H H H H H H H H H H H H H H
charge: -0.278544 -0.306968 -0.418889 -0.202938 -0.172662 -0.274349 -0.220176 -0.316511 0.215136 -0.230589 0.123339 -0.195496 -0.546987 0.376059 0.333050 -0.036419 -0.733421 0.075542 -0.101062 -0.398067 -0.689786 -0.734023 0.256861 -0.217894 -0.396278 0.276782 -0.749535 0.243374 0.275439 0.284154 0.305010 0.257770 0.244658 0.230150 0.236059 0.189810 0.358452 0.283986 0.247786 0.217491 0.224616 0.229681 0.220610 0.246169 0.237828 0.260338 0.249009 0.244424 0.277010
chargesum: 0.00000
title: Mulliken charges with hydrogens summed into heavy atoms:
elementType: O O O O O O O C C C C C C C C C C C C C C C C C C C C
charge: -0.278544 -0.306968 -0.060438 -0.202938 -0.172662 -0.274349 -0.220176 -0.073137 0.215136 0.044850 0.123339 0.088658 0.015794 0.376059 0.333050 -0.036419 -0.022554 0.075542 0.088748 -0.114081 0.000107 -0.037562 0.256861 0.019934 -0.135940 0.276782 0.020908
polarizability: 2.76353232e+02 -1.00168248e+01 2.28529887e+02 2.31718587e+00 -2.07465741e+01 1.81743685e+02
1716.lowfreq: -14.5450 -6.2089 -0.0007 -0.0007 -0.0004 4.9811 16.3067 49.0185 61.0469
frequency: 11.7436 48.9750 61.0220 65.8620 76.1454 89.3814 108.1317 109.3794 118.4407 135.2709 153.4663 168.5428 185.9277 193.6839 206.2734 212.0851 222.1842 232.6117 244.5150 248.9373 254.8460 271.9896 277.1504 288.8545 309.8917 311.6564 327.0244 371.3883 381.6541 385.6796 403.8365 414.8760 443.7569 451.2630 466.7008 475.9538 500.9307 506.8487 524.6201 534.3739 549.0886 567.3133 584.3114 605.6291 618.8894 674.0451 682.5117 706.5776 728.8658 744.8515 757.3729 762.0896 790.3008 802.8221 827.7868 832.5107 861.7861 884.3806 904.0797 917.4105 924.5148 933.2925 944.0170 962.4629 964.8530 991.9556 993.6505 999.9124 1002.3779 1008.7093 1022.1598 1038.8925 1045.2138 1059.2685 1063.1788 1071.6976 1099.8448 1103.2204 1133.4660 1141.7594 1159.3709 1163.2365 1168.3932 1177.4132 1199.8753 1201.7111 1218.4513 1219.9042 1242.6623 1250.6949 1262.7570 1282.5337 1300.7583 1304.6562 1314.3995 1328.9302 1376.4719 1379.5764 1380.8411 1386.6512 1390.0575 1392.1308 1393.3315 1430.4438 1442.4250 1447.0091 1449.7535 1452.5948 1455.0651 1457.7816 1468.4372 1472.9943 1481.2997 1484.4324 1566.3811 1589.8271 1606.9873 1652.5671 1678.1997 2857.4686 2992.4040 3000.4012 3001.2866 3002.9148 3006.9388 3007.7603 3026.0148 3054.5482 3094.4820 3098.0469 3101.0514 3102.1428 3107.3106 3107.4057 3120.1460 3122.6289 3144.0974 3145.1040 3172.1393 3183.7543 3561.1506
redmass: 4.5395 6.3856 5.0065 3.4012 5.1003 4.3248 5.4794 1.1996 4.4323 7.1444 4.6491 3.7363 3.5924 3.1293 1.3347 3.0539 1.1367 3.5205 2.5651 1.7331 2.7780 4.1549 2.3369 4.1957 3.8650 3.6984 4.0753 3.2426 1.3575 3.6737 5.1667 5.4334 4.0485 5.3731 4.4467 3.6943 3.1844 4.9785 4.8780 3.4747 3.7805 4.3347 4.6060 4.8895 4.7395 5.5487 5.0257 4.1416 5.6449 4.3783 4.5811 4.7757 2.5379 4.5413 2.7903 3.4264 2.7005 3.4914 2.9036 2.5714 1.4926 1.3899 2.6215 2.6243 2.4719 1.8741 2.0905 1.4738 1.3535 4.9322 2.5488 1.6514 3.5250 2.6827 2.8779 2.0507 3.4988 2.5744 2.5993 2.4138 1.9936 2.2828 2.3230 1.3489 1.7555 1.8590 2.7167 2.1162 1.9105 2.0330 2.0749 1.6413 1.4749 1.4808 1.4219 1.4349 8.2267 1.2802 1.2676 1.1924 1.2075 1.3692 1.3266 3.4374 2.0812 1.0566 1.0674 1.0547 1.0767 1.1209 1.0563 1.0630 1.0480 1.0846 7.7104 9.1375 7.6840 9.5101 10.3628 1.0851 1.0351 1.0852 1.0807 1.0392 1.0379 1.0355 1.0653 1.0851 1.1003 1.0995 1.0946 1.1004 1.0999 1.1008 1.1006 1.1007 1.0882 1.1023 1.0933 1.0959 1.0661
irintensity: 0.0306 0.8819 0.3258 7.9089 8.3643 0.7118 10.1704 0.6280 5.5988 0.8772 1.1688 5.8142 0.7428 0.7556 1.2451 0.7371 0.2265 3.1926 0.1952 2.4910 0.1063 0.2331 0.3761 1.5771 7.2383 2.9605 7.6373 16.2274 96.3984 16.7747 4.6668 8.5869 2.1696 17.2752 3.0927 0.9250 12.4623 7.0475 4.7842 7.8006 3.9657 6.1147 1.7438 3.4902 16.2431 7.4089 33.5814 4.3675 2.7911 3.7547 14.8788 15.6969 13.2762 0.8935 13.0652 100.4776 25.6126 36.3940 21.4228 18.4543 4.7729 0.4101 46.0978 60.3368 14.5813 8.4905 95.1765 2.8988 8.1977 105.3786 23.0157 7.7086 8.2482 8.6404 51.3765 10.4751 21.9623 15.7826 48.8066 21.7872 1.3200 395.6033 149.1034 4.9298 30.1117 66.3002 10.6969 77.2376 10.8615 26.6839 12.5688 32.2640 8.4286 17.8205 18.5462 14.7697 8.1079 37.8611 77.1761 1.0065 22.8283 19.9406 15.9889 18.9685 34.5179 5.5361 16.9328 24.7315 7.1938 5.2541 0.7752 7.0221 12.3241 25.5087 43.5784 185.6255 39.8667 154.6726 162.4646 78.8624 11.5035 8.2435 14.8498 19.8726 0.4389 9.5967 20.3642 18.1576 24.2881 27.0907 7.4954 17.3240 12.6237 0.9683 22.8816 14.2391 9.2415 6.7379 3.7433 7.9270 15.3086
temp: 298.150 k
press: 1.00000 atm
elementType: 8 8 8 8 8 8 8 6 6 6 6 6 6 6 6 6 6 6 6 6 6 6 6 6 6 6 6 1 1 1 1 1 1 1 1 1 1 1 1 1 1 1 1 1 1 1 1 1 1
symmnumber: 1
zpe: 1003326.8 jmol-1
zpe.correction: 0.382147 hartree
zpe.thermalcorrener: 0.407849 hartree
zpe.thermalcorrenthalpy: 0.408793 hartree
zpe.thermalcorrgfe: 0.327870 hartree
zpe.sumelectzpe: -1299.873464 hartree
zpe.sumelectthermal: -1299.847763 hartree
zpe.sumelectthermalent: -1299.846819 hartree
zpe.sumelectthermalfe: -1299.927742 hartree
dipole: 0.8390 3.3979 0.5429
dipole: 3.5418
quadrupole: -154.2581 -159.9092 -154.8156
quadrupole: -6.0095 -7.9963 -11.3220
quadrupole: 2.0695 -3.5816 1.5121 -6.0095 -7.9963 -11.3220
hfenergy: -1300.2556114 hartree
pointgroup: C01 [X(C20H22O7)]
dipole: -0.4560558 -1.3102581 0.1302317 debye
polarizability: 273.7878775|-13.7307482|227.600725|-3.8847236|24.6749443|185.2382011 unknown
InChI: InChI=1S/C20H22O7/c1-10(22)25-13-7-5-6-12-15(13)16(24)11-8-14(23)20(9-21)17(11)19(12,4)26-18(2,3)27-20/h5-7,9,11,14,17,23H,8H2,1-4H3
charge 0 multiplicity 1
49 atoms
O  2.330697 -0.015382 -1.08313
O  2.114562 -1.869519 0.48432
O  1.318565 2.961734 -1.5923
O  -2.35465 0.96008 2.006625
O  4.163926 2.065721 -0.352717
O  -3.865857 -0.185694 -0.189347
O  -3.001575 1.89383 -0.83961
C  1.263276 0.401945 1.172712
C  1.92797 1.002323 -0.113404
C  -0.015082 1.276874 1.458367
C  0.949205 -1.121579 1.011107
C  0.801687 1.860983 -0.785626
C  0.011601 2.433097 0.396452
C  -0.294122 -1.368231 0.137405
C  2.994766 -1.205987 -0.534002
C  -1.364111 0.557451 1.328076
C  0.714725 -1.764548 2.400674
C  -1.450767 -0.556615 0.338486
C  3.066222 1.986599 0.233723
C  -0.353647 -2.483634 -0.724649
C  4.333917 -0.924765 0.1673
C  3.144452 -2.155123 -1.724791
C  -2.642675 -0.886779 -0.369078
C  -1.545639 -2.788087 -1.414889
C  -2.694437 -1.985359 -1.244584
C  -3.929461 1.227341 -0.347053
C  -5.249017 1.730838 0.170731
H  1.953818 0.488058 2.033061
H  0.008644 1.699669 2.476965
H  0.185799 1.171291 -1.397145
H  -0.99555 2.75375 0.090834
H  0.544741 3.312983 0.798512
H  0.528403 -2.845213 2.28181
H  1.613133 -1.632241 3.027518
H  -0.155153 -1.316004 2.91214
H  2.809039 2.682224 1.074526
H  1.813362 2.591481 -2.367177
H  0.535273 -3.110398 -0.827486
H  5.010144 -0.362947 -0.49631
H  4.194004 -0.350459 1.098079
H  4.794201 -1.8904 0.438226
H  3.935567 -1.791711 -2.402389
H  3.416793 -3.160794 -1.363479
H  2.198001 -2.21083 -2.285475
H  -1.586002 -3.654354 -2.083642
H  -3.629659 -2.200161 -1.769421
H  -6.069081 1.047013 -0.099786
H  -5.443597 2.743245 -0.21148
H  -5.187511 1.763585 1.27422
