program: Gaussian 09
title: 000273426
version: EM64L-G09RevD.01
frameworkgroup: C1[X(C14H12O5)]
method: RPBEPBE
basis: SDD
operation: Freq
keyword: #pfreq=noraman
keyword: PBEPBE/SDD
title: #p freq=noraman PBEPBE/SDD
converged: NO YES NO NO
title: Mulliken charges:
elementType: O O O O O C C C C C C C C C C C C C C H H H H H H H H H H H H
charge: -0.253337 -0.283257 -0.233194 -0.191396 -0.212573 0.383098 0.216011 0.055267 -0.331457 -0.373451 0.149778 -0.532897 -0.458543 0.081222 0.381977 -0.337537 -0.688383 0.273298 -0.753666 0.302208 0.252799 0.296240 0.250014 0.249909 0.310991 0.227490 0.215038 0.227528 0.256229 0.256329 0.264269
chargesum: 0.00000
title: Mulliken charges with hydrogens summed into heavy atoms:
elementType: O O O O O C C C C C C C C C C C C C C
charge: -0.253337 -0.283257 -0.233194 -0.191396 -0.212573 0.383098 0.216011 0.055267 -0.029249 -0.120653 0.149778 -0.236657 0.041381 0.081222 0.381977 -0.026546 -0.018328 0.273298 0.023160
polarizability: 3.46448094e+02 -1.15451960e+01 1.63185630e+02 -3.19927936e-02 2.04779565e-02 7.92126312e+01
1716.lowfreq: -81.6414 -0.0005 0.0004 0.0005 2.2734 7.3142 10.7907 22.5999 28.8900
frequency: -81.6401 22.3548 28.8685 43.7036 73.0892 92.1077 94.6702 109.5084 156.6049 185.2389 211.4685 213.7512 240.5497 254.2090 285.4365 321.8749 338.9796 362.1831 394.6325 424.1591 446.4641 460.1282 501.4540 543.9055 554.5027 561.8192 612.8774 628.5188 629.0035 684.6284 713.7437 721.2672 739.0283 745.6750 797.7748 798.5258 834.2619 839.8870 873.1263 887.7576 965.4553 973.5898 979.0278 994.5870 998.2427 1033.6546 1045.6077 1069.9190 1084.7943 1103.5455 1147.4260 1154.4895 1177.7031 1212.8877 1239.4461 1256.5496 1270.6786 1348.5703 1358.0876 1387.6473 1396.6871 1397.5630 1406.8230 1425.8080 1452.7546 1456.9973 1469.9506 1477.1386 1484.3906 1535.3831 1562.2517 1602.7032 1627.9300 1664.8853 1684.0805 2984.2947 2998.8203 3010.6679 3020.9198 3096.2322 3096.3162 3099.3523 3129.3174 3149.1740 3149.6677 3192.9926 3219.9884
redmass: 1.0378 4.8364 6.6580 5.4583 3.4389 4.8483 2.2599 6.5823 4.5205 1.5309 2.7166 7.8900 4.9115 6.8230 5.2773 5.6858 4.4448 7.0778 6.7278 3.7865 7.9733 2.9542 4.8482 2.4313 8.2460 3.3092 7.9527 5.3120 5.4268 4.5789 4.3738 7.4794 7.0955 3.5637 5.2930 1.6491 8.0404 1.3879 6.4543 1.5617 3.5671 1.3142 3.0229 1.4016 1.9555 1.7956 1.6058 1.6851 2.7325 2.1492 2.0717 2.8426 1.7430 4.4366 1.1762 1.5842 2.1580 2.1506 2.5270 1.2305 1.2293 5.0875 1.1542 4.6953 1.0617 1.0453 1.0398 1.0552 3.3067 8.4655 7.6634 7.3098 7.7049 11.1895 12.1420 1.0625 1.0364 1.0372 1.0954 1.0970 1.1004 1.0995 1.0918 1.0918 1.1008 1.0933 1.0946
irintensity: 1.1972 0.4300 7.0452 1.1647 3.3189 0.2248 0.9260 2.4114 6.8738 0.8209 0.1471 2.1444 3.6395 0.3374 15.2866 2.3738 1.2221 0.7136 1.0531 0.3912 7.9944 6.0752 3.6570 1.6889 0.0304 2.3605 5.6465 32.2321 40.2140 9.1051 4.3150 8.3431 42.2850 3.2505 7.7732 17.4925 11.4675 34.6666 62.6317 46.7908 118.7446 11.9012 11.5849 5.9823 152.6496 10.6938 10.3278 1.1523 67.5337 339.4624 44.1013 1081.0573 13.0565 40.5961 0.1665 45.1669 7.7581 44.1359 13.7618 67.6992 28.9130 2.1982 39.8515 93.5941 14.4600 18.9450 12.1491 19.6109 123.7438 259.6463 11.4744 55.2574 456.1598 198.8107 440.0845 28.9451 31.4906 1.1543 2.8574 3.8462 28.0644 31.5769 0.9986 4.3936 5.7167 1.5403 7.0511
temp: 298.150 k
press: 1.00000 atm
elementType: 8 8 8 8 8 6 6 6 6 6 6 6 6 6 6 6 6 6 6 1 1 1 1 1 1 1 1 1 1 1 1
symmnumber: 1
zpe: 598268.8 jmol-1
zpe.correction: 0.227869 hartree
zpe.thermalcorrener: 0.244999 hartree
zpe.thermalcorrenthalpy: 0.245943 hartree
zpe.thermalcorrgfe: 0.180986 hartree
zpe.sumelectzpe: -915.461344 hartree
zpe.sumelectthermal: -915.444214 hartree
zpe.sumelectthermalent: -915.443270 hartree
zpe.sumelectthermalfe: -915.508227 hartree
dipole: 4.6723 0.0136 -0.0254
dipole: 4.6724
quadrupole: -98.3737 -120.4519 -108.8690
quadrupole: 8.2761 -0.1118 0.0881
quadrupole: 10.8578 -11.2203 0.3625 8.2761 -0.1118 0.0881
hfenergy: -915.6892127 hartree
pointgroup: C01 [X(C14H12O5)]
dipole: 1.8318231 -0.0907307 -0.1240682 debye
polarizability: 344.3492495|-3.6967598|136.8448675|-25.9999483|-38.2479014|107.6522377 unknown
InChI: InChI=1S/C14H12O5/c1-3-12(16)11-6-9-4-5-10(18-8(2)15)7-13(9)19-14(11)17/h4-7H,3H2,1-2H3
charge 0 multiplicity 1
31 atoms
O  -0.531747 -0.946183 1.072702
O  4.088282 -0.34514 0.178388
O  -3.935751 2.11631 -0.616978
O  -2.714122 -1.400234 1.607779
O  5.356072 1.226939 -1.044383
C  0.09148 0.994569 -0.29076
C  0.445228 -0.17412 0.453122
C  -2.299375 0.590745 0.2325
C  -1.297125 1.340171 -0.374753
C  1.138942 1.742035 -0.902059
C  -3.728003 1.067649 0.06536
C  1.781938 -0.585023 0.585532
C  -4.875352 0.296228 0.700235
C  -1.96298 -0.61559 1.002562
C  2.78681 0.18349 -0.036485
C  2.481815 1.357173 -0.788383
C  -6.24985 0.92374 0.421246
C  5.296531 0.204938 -0.336202
C  6.462182 -0.644022 0.113661
H  -1.617886 2.22813 -0.934387
H  0.88239 2.63972 -1.475112
H  2.038459 -1.47965 1.156555
H  -4.829161 -0.754411 0.349114
H  -4.681494 0.209918 1.788436
H  3.277363 1.933085 -1.259099
H  -6.452688 0.972083 -0.662214
H  -7.045913 0.328638 0.902224
H  -6.301279 1.956457 0.806266
H  7.169074 -0.016673 0.684152
H  7.002209 -1.01805 -0.773604
H  6.132156 -1.489324 0.732082
