program: Gaussian 09
title: 000273417
version: EM64L-G09RevD.01
frameworkgroup: C1[X(C17H21NO5)]
method: RPBEPBE
basis: SDD
operation: Freq
keyword: #p
keyword: freq=noraman
keyword: PBEPBE/SDD
title: #p freq=noraman PBEPBE/SDD
converged: YES YES NO NO
title: Mulliken charges:
elementType: O O O O O N C C C C C C C C C C C C C C C C C H H H H H H H H H H H H H H H H H H H H H
charge: -0.319399 -0.164895 -0.191205 -0.195435 -0.249394 -0.456981 0.160752 -0.430104 -0.505124 0.091101 0.154610 0.309509 0.217673 0.249435 -0.350421 -0.329018 -0.775334 -0.260373 -0.788087 -0.236253 -0.265998 -0.232640 -0.657148 0.284173 0.280117 0.232835 0.244493 0.338530 0.275738 0.246436 0.258881 0.227745 0.239924 0.242772 0.224480 0.213285 0.256578 0.259372 0.234125 0.227333 0.232044 0.225984 0.220009 0.259875
chargesum: 0.00000
title: Mulliken charges with hydrogens summed into heavy atoms:
elementType: O O O O O N C C C C C C C C C C C C C C C C C
charge: -0.319399 -0.164895 -0.191205 -0.195435 -0.249394 -0.118451 0.160752 0.134186 -0.027797 0.091101 0.154610 0.309509 0.217673 0.249435 -0.074683 -0.082583 -0.048784 0.206880 -0.058853 -0.002128 -0.038665 -0.000596 0.048720
polarizability: 2.41321658e+02 6.03363455e+00 1.95092274e+02 -6.20067479e+00 2.13785181e+01 1.76867397e+02
1716.lowfreq: -6.9148 -0.0008 -0.0006 0.0002 5.7941 7.6435 20.6438 24.2447 30.9028
frequency: 19.9765 24.1475 30.7957 37.2003 45.0473 51.1906 58.4354 62.9184 68.3815 86.2836 92.9713 99.7421 106.3217 114.5247 142.4400 147.1023 173.3859 194.7531 213.5837 219.7502 235.7246 262.8927 307.9875 310.8108 347.6570 359.2378 402.2466 413.0269 414.8776 430.7901 463.4243 477.7330 520.7149 522.0875 565.6863 604.2080 609.6630 614.4865 629.0629 647.1727 681.7056 699.1292 715.7918 742.2822 754.5043 772.1993 804.9938 818.7472 845.9312 858.2461 861.5591 893.5251 927.3663 943.8904 951.8112 982.0817 982.5214 987.4282 990.7596 1004.9447 1010.7570 1013.0066 1033.5111 1041.2632 1064.9206 1085.5617 1090.5307 1096.2194 1129.8067 1139.2801 1154.4905 1169.5319 1174.6625 1194.0115 1210.9546 1227.3275 1261.2064 1277.9099 1285.1219 1290.3788 1324.3107 1350.7947 1353.8257 1368.5037 1385.7438 1386.2416 1391.2163 1428.4627 1435.2636 1443.2241 1447.4199 1453.3753 1455.2788 1457.1619 1457.6177 1463.3989 1472.1973 1480.5422 1482.0113 1578.6027 1596.5173 1603.9280 1612.6580 1639.8908 1649.2268 2952.7916 2980.0921 2994.3691 2995.7646 3000.8334 3032.7451 3049.7047 3066.9338 3087.9469 3094.2250 3096.0056 3103.4765 3118.9519 3119.2525 3121.4343 3127.1160 3140.4415 3155.5172 3167.5862 3173.8675 3535.6178
redmass: 3.5910 4.3337 3.7209 2.5947 1.7887 3.5144 3.6456 1.1903 2.5764 7.2024 3.5211 2.7504 4.6509 2.8941 4.6938 7.4662 5.4216 1.7530 4.2904 2.6309 2.8888 4.7222 2.9271 3.7289 5.1433 6.8509 2.9413 3.1940 3.8496 3.9441 2.0972 4.1972 5.1146 4.1594 2.5891 4.8353 2.5350 6.1612 2.0200 4.4153 3.8581 1.9701 2.9165 1.5512 3.9555 2.1393 1.7944 2.1731 3.2399 1.3829 3.5997 2.2843 2.4995 1.4454 1.9371 2.9613 1.8090 1.4661 4.9512 1.3387 2.9969 3.0826 2.1613 1.6641 2.7411 2.5861 1.8031 2.2570 3.0285 3.0082 1.6380 2.4078 1.0618 1.1381 1.8013 3.7553 1.8197 1.1306 1.5706 1.2664 1.3209 1.6580 1.2723 1.2375 7.3405 1.2662 1.2293 1.1023 2.2493 1.0677 1.1599 1.1465 1.2785 1.0787 1.0692 1.0482 1.3814 2.0087 1.0927 6.8450 7.3257 6.7831 6.9347 7.8973 10.7190 1.0598 1.0382 1.0361 1.0360 1.0968 1.0593 1.0614 1.0951 1.0980 1.0990 1.1029 1.0997 1.1004 1.1022 1.1065 1.0854 1.0894 1.0939 1.0945 1.0992 1.0781
irintensity: 2.4966 1.7969 1.0245 0.0266 0.8951 0.3325 0.4070 0.2755 0.6247 15.0120 3.8401 2.1080 1.4767 1.1103 0.7190 2.8801 2.4387 4.5934 11.1576 1.4625 4.0636 5.1570 5.9888 1.6717 4.0335 2.1959 0.1706 17.0758 0.8937 1.0693 1.9361 6.0067 21.9938 11.8520 59.9335 3.7590 97.5132 2.5028 4.3138 30.8625 2.2725 35.0901 18.8143 24.8300 4.9761 32.6234 4.1690 1.0796 10.5325 3.4703 24.4242 6.9726 22.1229 2.8878 14.8379 12.7389 18.2865 0.8508 2.9708 0.6245 52.5749 76.6449 5.5416 15.8852 132.1541 31.8118 1.4512 12.2803 159.8596 8.6370 5.1565 91.6502 0.2929 14.3454 29.1533 119.4297 62.5988 4.1359 72.4409 11.8244 2.0383 21.4489 0.6356 60.8432 3.1152 63.0045 21.9754 12.4119 24.2627 23.6256 79.2727 48.7477 135.6603 13.1374 4.8453 17.5222 53.3336 2.5098 26.7025 39.0173 23.7058 96.5676 27.2780 114.2900 187.5690 20.5646 6.0859 13.2448 9.6877 11.9676 29.3422 0.0510 15.5010 36.8763 12.9165 3.5801 10.3004 13.4642 1.7322 23.8819 0.9602 13.7135 19.4561 11.1725 14.7109 54.5219
temp: 298.150 k
press: 1.00000 atm
elementType: 8 8 8 8 8 7 6 6 6 6 6 6 6 6 6 6 6 6 6 6 6 6 6 1 1 1 1 1 1 1 1 1 1 1 1 1 1 1 1 1 1 1 1 1
symmnumber: 1
zpe: 915923.2 jmol-1
zpe.correction: 0.348857 hartree
zpe.thermalcorrener: 0.373994 hartree
zpe.thermalcorrenthalpy: 0.374938 hartree
zpe.thermalcorrgfe: 0.290051 hartree
zpe.sumelectzpe: -1089.570923 hartree
zpe.sumelectthermal: -1089.545786 hartree
zpe.sumelectthermalent: -1089.544842 hartree
zpe.sumelectthermalfe: -1089.629729 hartree
dipole: -1.8613 6.4841 7.6069
dipole: 10.1672
quadrupole: -120.5872 -134.3051 -139.3369
quadrupole: 9.3054 10.8941 0.7845
quadrupole: 10.8225 -2.8954 -7.9272 9.3054 10.8941 0.7845
hfenergy: -1089.91978 hartree
pointgroup: C01 [X(C17H21N1O5)]
dipole: -0.4813484 -3.2579205 -2.2704345 debye
polarizability: 237.4608989|-6.6419266|205.1650066|17.9367808|12.4033017|170.655423 unknown
InChI: InChI=1S/C17H21NO5/c1-4-23-16(22)17(18-13(3)20,11-10-12(2)19)15(21)14-8-6-5-7-9-14/h5-9,18H,4,10-11H2,1-3H3
charge 0 multiplicity 1
44 atoms
O  0.364827 -2.433312 -0.102897
O  -0.455322 1.684844 1.668816
O  0.451652 -1.616498 2.081886
O  4.471278 1.586849 1.403173
O  0.240035 2.144584 -1.585148
N  0.555352 -0.126483 -1.260104
C  0.564831 -0.010606 0.209678
C  1.888242 0.636767 0.730822
C  3.136475 -0.177986 0.358152
C  -0.653525 0.88246 0.725067
C  0.439751 -1.405108 0.85332
C  -2.017839 0.708685 0.124751
C  4.448037 0.5159 0.743632
C  0.406524 0.983027 -2.071887
C  -2.94806 1.76587 0.318938
C  -2.431461 -0.457634 -0.572402
C  5.733077 -0.155608 0.265059
C  0.248108 -3.831616 0.432081
C  0.434706 0.719271 -3.571788
C  -4.260057 1.66565 -0.181902
C  -3.751099 -0.561271 -1.062919
C  -4.666558 0.500023 -0.875741
C  -1.211792 -4.181419 0.727261
H  1.808579 0.752719 1.822749
H  1.946441 1.654137 0.308959
H  3.170898 -0.393838 -0.730368
H  3.135906 -1.169089 0.861357
H  0.635428 -1.065442 -1.655916
H  -2.614647 2.655894 0.861539
H  -1.738266 -1.289919 -0.723091
H  6.590853 0.198718 0.857981
H  5.664863 -1.25713 0.317036
H  5.911473 0.113548 -0.79487
H  0.870313 -3.901495 1.341133
H  0.674542 -4.45097 -0.372952
H  0.688863 -0.323155 -3.830532
H  1.166184 1.396531 -4.044099
H  -0.555652 0.960693 -3.996602
H  -4.965439 2.490551 -0.034694
H  -4.066477 -1.468301 -1.590766
H  -5.688119 0.419397 -1.264139
H  -1.275624 -5.232019 1.065881
H  -1.840282 -4.073795 -0.173798
H  -1.616519 -3.539526 1.527144
