program: Gaussian 09
title: 000273412
version: EM64L-G09RevD.01
frameworkgroup: C1[X(C17H19NO6)]
method: RPBEPBE
basis: SDD
operation: Freq
keyword: #p
keyword: freq=noraman
keyword: PBEPBE/SDD
title: #p freq=noraman PBEPBE/SDD
converged: YES YES NO NO
title: Mulliken charges:
elementType: O O O O O O N C C C C C C C C C C C C C C C C C H H H H H H H H H H H H H H H H H H H
charge: -0.447035 -0.220061 -0.255296 -0.243926 -0.265597 -0.262150 -0.384874 0.141397 -0.094982 -0.538874 -0.349058 -0.477686 -0.054123 -0.423919 0.492985 0.108364 0.223924 -0.505759 -0.426237 0.150145 -0.367099 0.161128 -0.203118 -0.502365 0.238307 0.248154 0.241083 0.300561 0.209248 0.227953 0.208583 0.231092 0.219931 0.311666 0.284089 0.232941 0.334709 0.251854 0.239552 0.238809 0.239025 0.236055 0.250604
chargesum: 0.00000
title: Mulliken charges with hydrogens summed into heavy atoms:
elementType: O O O O O O N C C C C C C C C C C C C C C C C C
charge: -0.112326 -0.220061 -0.255296 -0.243926 -0.265597 -0.262150 -0.073209 0.141397 0.143325 -0.049637 -0.048497 -0.040485 0.154459 0.027104 0.492985 0.108364 0.223924 -0.221670 -0.193296 0.150145 -0.115244 0.161128 0.275244 0.223320
polarizability: 2.44571843e+02 -6.82452093e+00 1.98979480e+02 -6.88202363e+00 1.89633642e+01 1.64552032e+02
1716.lowfreq: -45.8368 -0.0004 -0.0002 0.0004 2.0656 4.3622 10.9701 19.8831 38.3498
frequency: -45.8043 19.7631 38.2201 48.2119 59.1027 77.3831 86.6683 99.7449 117.4588 145.7125 149.9057 193.0340 196.8527 216.0630 225.0991 232.5861 247.1853 280.3297 294.0757 306.5516 319.6992 324.5213 351.1913 390.5524 423.7123 425.0994 441.0314 463.2753 489.1343 520.3190 531.5441 563.3760 584.0986 606.1053 630.0686 642.2110 658.6223 682.1039 714.6463 730.9355 734.0926 760.4924 780.5692 799.4349 807.8743 829.8711 843.7999 867.9150 884.1748 886.1267 900.9150 910.0823 925.7557 945.1068 956.4525 965.9882 980.2094 1008.1983 1024.8634 1041.2734 1058.9910 1064.2180 1076.4757 1090.1393 1112.1342 1114.1409 1119.2504 1122.2669 1137.2660 1141.4503 1151.6288 1168.3868 1182.8172 1210.3251 1218.8133 1237.9443 1245.6979 1259.6188 1273.7741 1290.4680 1297.8460 1310.6131 1318.4947 1326.2766 1341.8673 1360.0811 1363.7272 1372.5607 1375.1466 1383.1551 1409.0578 1421.6667 1442.6422 1453.1784 1457.1786 1461.8673 1470.1203 1473.5702 1478.5142 1488.1756 1612.1330 1629.6425 1636.1875 1677.4358 2937.3161 2938.9528 2986.6430 2995.8726 3002.8029 3007.9380 3013.8836 3017.5732 3038.2330 3068.6073 3077.9797 3092.4988 3111.9247 3153.9993 3160.4876 3170.8712 3182.8732 3553.6107 3565.6654
redmass: 2.2785 5.7610 5.3365 7.0531 6.3003 6.1037 1.5536 2.1531 4.5636 3.9918 5.4968 5.4132 5.2272 4.9759 4.4118 5.7412 4.7084 3.2944 3.2751 1.3429 4.9192 3.3874 4.7986 4.2213 4.4743 3.1769 2.2563 3.7203 2.6279 2.8236 3.3293 5.5573 3.9188 2.8340 4.9772 5.8355 5.5970 9.4974 5.0345 5.5459 3.8713 3.8724 5.9232 2.0029 1.4673 4.3065 7.4126 5.6942 3.0719 3.5348 1.4212 2.6078 1.3721 2.6072 4.1012 3.0437 3.5380 3.6250 2.3031 2.0236 3.5362 1.4581 4.3781 2.0401 1.5809 1.3889 1.0371 2.3535 1.6898 2.2453 1.4757 1.6101 1.4522 1.7576 1.5770 3.2673 2.0451 1.6322 1.5569 1.4352 1.3821 1.4988 1.2985 1.7149 1.4597 1.4060 1.4595 2.2394 1.5904 1.9357 1.6726 1.1943 3.8968 1.0498 1.1244 1.0510 1.0895 1.1537 1.6739 1.4566 7.7587 8.2651 8.8037 9.4376 1.0835 1.0824 1.0627 1.0812 1.0629 1.0295 1.0534 1.0619 1.0983 1.1021 1.1005 1.1190 1.1047 1.1050 1.0877 1.0923 1.0963 1.0660 1.0788
irintensity: 13.6514 2.1293 0.5926 0.4099 0.5948 1.5034 1.0634 0.6970 1.6854 1.1124 2.2805 2.7534 4.1627 0.8546 1.5311 9.5990 2.5168 22.7150 1.2587 108.0135 22.9180 5.8943 4.5809 0.6254 6.3646 6.7333 1.6588 12.8237 5.9721 32.6488 21.8355 9.3828 3.7538 54.0905 22.7100 5.1456 9.1011 0.6402 2.7793 1.7016 14.2195 3.5227 12.7268 2.0599 37.1263 19.4016 16.1270 10.3884 15.3743 4.6624 17.0149 7.0480 4.2924 1.3763 27.4276 43.4560 127.3995 50.3961 25.0970 4.4460 19.7870 3.7362 143.0339 28.4124 2.0784 2.0586 0.0293 53.3598 26.4152 94.2144 26.4896 23.3097 11.3536 35.3222 41.4888 130.6317 39.9011 134.6473 55.4078 26.0597 16.6318 21.7605 6.4909 27.9860 18.0447 20.6615 8.0405 8.6119 10.4536 17.0404 5.3772 20.9126 33.6628 13.7391 14.0706 10.9469 13.6516 50.3316 108.6509 63.2307 8.7148 1.0959 179.7996 377.8556 27.1407 61.2384 43.9554 2.7429 24.5093 29.4150 128.4178 11.7169 38.7507 30.2756 29.5799 30.4530 20.7102 14.7763 10.2518 1.4745 5.6598 5.0983 29.5161
temp: 298.150 k
press: 1.00000 atm
elementType: 8 8 8 8 8 8 7 6 6 6 6 6 6 6 6 6 6 6 6 6 6 6 6 6 1 1 1 1 1 1 1 1 1 1 1 1 1 1 1 1 1 1 1
symmnumber: 1
zpe: 886995.5 jmol-1
zpe.correction: 0.337839 hartree
zpe.thermalcorrener: 0.359025 hartree
zpe.thermalcorrenthalpy: 0.359969 hartree
zpe.thermalcorrgfe: 0.287065 hartree
zpe.sumelectzpe: -1163.506895 hartree
zpe.sumelectthermal: -1163.485709 hartree
zpe.sumelectthermalent: -1163.484765 hartree
zpe.sumelectthermalfe: -1163.557669 hartree
dipole: -3.9486 -1.1581 -2.1248
dipole: 4.6311
quadrupole: -143.2493 -132.9843 -140.7614
quadrupole: -11.5304 -9.5772 11.1772
quadrupole: -4.2509 6.0140 -1.7631 -11.5304 -9.5772 11.1772
hfenergy: -1163.8447338 hartree
pointgroup: C01 [X(C17H19N1O6)]
dipole: -1.5221419 0.2141869 0.9782553 debye
polarizability: 244.9818346|6.1372473|187.3958979|5.820884|24.8673365|175.7256222 unknown
InChI: InChI=1S/C17H19NO6/c1-22-16(21)14-15(20)18-13-5-3-10(19)7-17(13,14)9-2-4-11-12(6-9)24-8-23-11/h2,4,6,10,13-14,18-19H,3,5,7-8H2,1H3
charge 0 multiplicity 1
43 atoms
O  1.479624 3.319669 -2.230601
O  3.782243 -1.726035 0.206071
O  0.999751 -3.318743 -0.646218
O  0.987855 -1.634184 -2.247224
O  -3.996915 -0.575277 -1.250944
O  -4.957519 0.248235 0.794343
N  2.932546 0.269354 1.147981
C  0.767837 0.361183 0.185338
C  1.631912 0.939043 1.375959
C  1.156837 1.120233 -1.128911
C  1.320359 -1.116567 0.169374
C  1.747558 2.477216 1.446214
C  1.089299 2.651755 -0.975744
C  2.079069 3.133294 0.089803
C  -0.753734 0.391448 0.426172
C  2.843502 -0.937338 0.480066
C  1.083679 -1.98977 -1.049133
C  -1.607543 -0.118379 -0.605218
C  -1.338911 0.870232 1.626615
C  -2.98091 -0.116668 -0.375596
C  -2.745343 0.866821 1.847387
C  -3.546561 0.364744 0.823721
C  -5.280103 -0.340913 -0.53494
C  0.894019 -4.317761 -1.738168
H  1.211342 0.572134 2.337477
H  0.504287 0.788976 -1.95409
H  2.187438 0.854421 -1.429285
H  0.895456 -1.659793 1.037615
H  2.509361 2.749476 2.203693
H  0.78557 2.877246 1.819298
H  0.0546 2.954105 -0.69671
H  2.034178 4.233826 0.174509
H  3.100299 2.86932 -0.244559
H  3.814439 0.606152 1.536153
H  -1.205015 -0.503586 -1.545987
H  -0.709452 1.261267 2.429744
H  0.926523 2.960393 -2.97067
H  -3.177831 1.242078 2.778097
H  -5.789419 -1.307961 -0.384303
H  -5.886301 0.380625 -1.109565
H  -0.019617 -4.140242 -2.329959
H  0.855496 -5.288124 -1.224767
H  1.776194 -4.248908 -2.395535
