program: Gaussian 09
title: 000273399
version: EM64L-G09RevD.01
frameworkgroup: C1[X(C14H15NO2)]
method: RPBEPBE
basis: SDD
operation: Freq
keyword: #p
keyword: freq=noraman
keyword: PBEPBE/SDD
title: #p freq=noraman PBEPBE/SDD
converged: YES YES NO NO
title: Mulliken charges:
elementType: O O N C C C C C C C C C C C C C C H H H H H H H H H H H H H H H
charge: -0.229066 -0.287036 -0.376219 -0.262414 -0.442465 0.435516 -0.530160 -0.494608 0.144604 0.292316 -0.370740 -0.342638 0.262560 -0.271084 -0.243110 -0.772518 -0.234054 0.289567 0.225685 0.229107 0.262443 0.224488 0.245755 0.306478 0.285207 0.223975 0.235986 0.231252 0.256508 0.213350 0.256802 0.234511
chargesum: 0.00000
title: Mulliken charges with hydrogens summed into heavy atoms:
elementType: O O N C C C C C C C C C C C C C C
charge: -0.229066 -0.287036 -0.069742 0.027153 0.012327 0.435516 -0.043229 -0.248853 0.144604 0.292316 -0.085533 -0.118663 0.262560 -0.035098 -0.011858 -0.045857 0.000458
polarizability: 2.34681779e+02 2.51413611e+01 1.84447759e+02 -4.18921842e+00 -1.52000154e+01 1.01109627e+02
1716.lowfreq: -7.1705 -0.0010 -0.0006 -0.0003 3.9216 9.6643 18.5677 45.1228 57.2598
frequency: 17.7808 45.0753 57.2509 65.6725 74.2694 103.2732 143.9741 152.2957 193.8740 212.8961 244.4622 286.8583 341.2338 372.4716 398.8170 403.6236 458.3419 483.0581 503.5679 536.4103 570.0450 588.7789 594.4928 609.4709 615.7371 655.7732 665.7889 694.4997 758.8798 783.3613 820.4968 851.3137 887.7523 897.1141 922.8657 941.9626 965.7580 972.9646 984.3059 988.8472 990.8405 1006.0208 1007.4002 1034.1175 1041.0950 1076.9736 1096.7523 1114.0740 1163.3306 1178.6307 1194.9673 1216.1537 1239.9479 1251.9453 1273.6208 1292.4685 1305.3160 1327.1144 1335.8357 1346.7303 1382.8898 1387.0643 1388.4833 1438.4550 1445.6200 1449.3641 1460.4694 1463.4229 1473.1269 1495.7742 1567.3131 1579.4231 1597.0700 1605.7410 1611.9842 2974.1033 2997.7859 3000.7701 3045.9283 3062.7834 3067.3772 3099.7513 3101.2294 3128.8045 3135.7297 3142.4232 3148.0473 3157.3929 3169.1314 3548.4906
redmass: 3.9753 2.9526 2.0718 5.1766 2.0409 3.0947 5.1270 3.6150 3.8498 5.7764 3.2752 4.5734 4.3279 3.3245 2.7823 3.0427 3.1521 3.7063 3.4480 2.5223 1.9749 3.7816 3.1653 2.7284 6.1968 4.0805 3.7519 1.8807 1.9518 1.9135 4.5222 1.2921 3.5159 1.7450 2.1357 1.4590 2.0279 3.3246 4.1972 1.4515 3.5819 1.6230 1.3554 2.1533 1.6459 2.4696 1.6793 2.0366 1.3988 1.0633 1.4884 1.2040 1.8537 2.4741 2.2525 1.3964 1.5523 1.7407 1.6656 1.5931 5.4911 1.2535 1.3619 2.3014 1.1342 1.0463 1.2860 1.1141 1.4078 2.0733 9.2586 5.1694 6.1228 6.0090 6.0945 1.0674 1.0360 1.0621 1.0831 1.0957 1.0993 1.0981 1.1007 1.0851 1.0886 1.0914 1.0923 1.0945 1.1011 1.0778
irintensity: 2.8388 5.5661 1.8603 13.2523 1.0593 1.0139 1.6852 2.4271 3.0120 4.8161 3.0878 2.9726 2.4694 2.0333 0.6481 5.3124 6.2664 14.6600 12.8836 16.2147 66.0005 1.9834 9.4774 1.2979 0.2566 2.7471 4.5178 41.7735 8.2816 65.4370 3.2451 1.5269 1.1177 13.5219 11.8160 6.5057 22.8298 3.3154 7.1352 2.1659 3.5063 2.9150 0.6338 4.3443 9.3363 11.3490 6.2143 4.9351 28.4575 0.2820 48.4216 7.0007 29.9035 17.0026 160.2472 12.5862 52.6617 8.9189 25.1606 41.0661 10.0910 69.7814 4.0068 26.7701 27.7313 15.9374 129.3850 41.3699 79.5648 12.4683 95.3016 170.7837 172.6870 113.0574 26.9453 13.8182 10.4096 26.0302 10.0947 25.0694 22.9922 6.9351 16.6550 0.7236 13.2791 6.1964 0.4119 21.6405 34.7817 12.7824
temp: 298.150 k
press: 1.00000 atm
elementType: 8 8 7 6 6 6 6 6 6 6 6 6 6 6 6 6 6 1 1 1 1 1 1 1 1 1 1 1 1 1 1 1
symmnumber: 1
zpe: 678789.2 jmol-1
zpe.correction: 0.258537 hartree
zpe.thermalcorrener: 0.274188 hartree
zpe.thermalcorrenthalpy: 0.275132 hartree
zpe.thermalcorrgfe: 0.213594 hartree
zpe.sumelectzpe: -746.470521 hartree
zpe.sumelectthermal: -746.454870 hartree
zpe.sumelectthermalent: -746.453926 hartree
zpe.sumelectthermalfe: -746.515464 hartree
dipole: 1.4797 1.8417 1.5673
dipole: 2.8351
quadrupole: -93.5119 -113.9677 -100.2657
quadrupole: -16.3925 3.0699 10.4741
quadrupole: 9.0699 -11.3860 2.3161 -16.3925 3.0699 10.4741
hfenergy: -746.7290578 hartree
pointgroup: C01 [X(C14H15N1O2)]
dipole: 0.4240195 0.95363 0.3936033 debye
polarizability: 225.1686483|32.7214908|179.4719423|-4.2378217|-36.2600825|115.5985751 unknown
InChI: InChI=1S/C14H15NO2/c1-10(16)15-14-8-7-12(17)9-13(14)11-5-3-2-4-6-11/h2-6,9,14-15H,7-8H2,1H3
charge 0 multiplicity 1
32 atoms
O  -2.443196 -3.213259 1.533621
O  -0.651643 2.77392 -1.613835
N  -1.349732 1.313412 0.055244
C  -1.007711 0.084651 -0.703673
C  -2.271027 -0.684656 -1.159295
C  -0.066496 -0.794472 0.136327
C  -2.992156 -1.37373 0.014867
C  -0.600869 -1.863626 0.827825
C  -2.030579 -2.23041 0.840314
C  1.378513 -0.439904 0.190925
C  1.880838 0.709565 -0.490236
C  2.313788 -1.239118 0.916506
C  -1.162295 2.586111 -0.464619
C  3.252196 1.038522 -0.447732
C  3.681139 -0.910186 0.956511
C  -1.597202 3.739191 0.431952
C  4.161464 0.233166 0.273167
H  -0.490004 0.446756 -1.609099
H  -1.958907 -1.449319 -1.896521
H  -2.946524 0.01741 -1.680267
H  -3.822796 -2.014446 -0.32863
H  -3.446258 -0.619817 0.691666
H  0.023827 -2.517186 1.446643
H  -1.719723 1.207242 1.001742
H  1.210491 1.363479 -1.057301
H  1.977876 -2.133046 1.450856
H  3.607516 1.926521 -0.981523
H  4.375151 -1.545737 1.517501
H  -2.3435 4.349864 -0.104602
H  -2.027371 3.412685 1.394404
H  -0.727405 4.388577 0.631327
H  5.226497 0.48824 0.30224
