program: Gaussian 09
title: 000273398
version: EM64L-G09RevD.01
frameworkgroup: C1[X(C8H12O4)]
method: RPBEPBE
basis: SDD
operation: Freq
keyword: #pfreq=noraman
keyword: PBEPBE/SDD
title: #p freq=noraman PBEPBE/SDD
converged: YES YES NO NO
title: Mulliken charges:
elementType: O O O O C C C C C C C C H H H H H H H H H H H H
charge: -0.175326 -0.416335 -0.230379 -0.178101 -0.356414 -0.365016 -0.492366 -0.486406 0.117260 0.172504 0.128970 -0.745506 0.213745 0.213021 0.216420 0.217035 0.258895 0.260317 0.253828 0.253927 0.255413 0.256668 0.251014 0.376831
chargesum: 0.00000
title: Mulliken charges with hydrogens summed into heavy atoms:
elementType: O O O O C C C C C C C C
charge: -0.175326 -0.039504 -0.230379 -0.178101 0.070352 0.068439 0.026847 0.021348 0.117260 0.172504 0.128970 0.017590
polarizability: 1.22564529e+02 -1.98116982e+00 1.00468649e+02 1.51781123e-01 3.41909445e-03 6.36783506e+01
1716.lowfreq: -1.9361 -0.0006 0.0004 0.0005 4.3312 10.7578 14.1038 32.2511 44.8632
frequency: 13.2478 32.2269 44.2452 55.4444 58.5084 67.5934 105.9323 129.2972 143.2207 187.2809 267.2563 326.9717 346.0061 383.4225 465.6447 501.2748 523.0182 564.7274 586.4041 591.0660 635.7717 721.8622 776.2999 778.7708 857.6716 886.4242 921.2553 986.7326 1019.4023 1022.4426 1072.2263 1076.4377 1077.5155 1102.5121 1126.9738 1209.3315 1224.0474 1236.2682 1269.5837 1282.0539 1289.8022 1325.1908 1367.0700 1374.0208 1378.4814 1416.3687 1432.9202 1433.3046 1439.4103 1465.8911 1481.4110 1614.2283 1621.6780 1669.0637 2973.2590 2985.6410 2989.4141 2994.7498 2998.7435 3009.1825 3027.7004 3042.1394 3066.4562 3075.2264 3134.9234 3513.5913
redmass: 8.8899 3.8393 1.9629 5.6746 2.2031 1.4372 2.6451 1.8898 6.0622 9.2480 3.9685 5.1319 3.4435 4.4681 4.5213 1.7649 5.3599 4.0884 1.9726 4.3503 1.3316 1.1549 5.6808 1.4606 4.8096 1.5282 2.6959 1.5088 3.4111 2.6400 2.0999 2.6194 1.9044 2.8906 1.2855 2.2573 1.3098 1.5761 1.7187 1.1388 1.0578 1.7840 1.7332 1.2881 1.8318 1.0997 1.0737 1.0553 1.0849 1.0752 1.0944 8.9924 9.0931 8.2612 1.0622 1.0606 1.0611 1.0369 1.0594 1.0948 1.0987 1.1010 1.1032 1.0944 1.1018 1.0639
irintensity: 0.1796 1.0107 8.2459 0.3366 0.2601 0.9803 1.4711 1.4075 3.6312 2.1971 10.0103 10.4470 1.2732 26.5385 19.7368 30.1180 1.7394 5.5424 1.3074 28.1732 128.8499 19.2622 0.7637 0.3382 2.1873 7.3146 33.0891 1.7944 235.7348 3.4722 69.9335 22.8644 3.0293 6.6316 0.0447 62.7540 0.1441 0.9614 34.1332 0.2486 0.1195 7.3761 71.8450 46.8278 19.1689 32.6096 28.4170 22.1007 22.2544 0.3246 21.7822 43.1460 107.7276 208.0328 10.6895 4.5569 2.7105 0.0935 40.9764 0.3805 1.2989 1.8364 66.2852 4.4844 10.7575 19.8352
temp: 298.150 k
press: 1.00000 atm
elementType: 8 8 8 8 6 6 6 6 6 6 6 6 1 1 1 1 1 1 1 1 1 1 1 1
symmnumber: 1
zpe: 495231.5 jmol-1
zpe.correction: 0.188624 hartree
zpe.thermalcorrener: 0.202890 hartree
zpe.thermalcorrenthalpy: 0.203834 hartree
zpe.thermalcorrgfe: 0.143409 hartree
zpe.sumelectzpe: -612.006893 hartree
zpe.sumelectthermal: -611.992627 hartree
zpe.sumelectthermalent: -611.991683 hartree
zpe.sumelectthermalfe: -612.052108 hartree
dipole: 0.0864 -1.6148 0.0042
dipole: 1.6171
quadrupole: -61.5447 -86.3166 -67.7163
quadrupole: 0.5735 0.2839 -0.0312
quadrupole: 10.3145 -14.4574 4.1429 0.5735 0.2839 -0.0312
hfenergy: -612.1955171 hartree
pointgroup: C01 [X(C8H12O4)]
dipole: -0.08501 -0.4403122 0.4513076 debye
dipolederiv: -0.6503961 0.0317668 0.0534149 -0.0635536 -0.4775792 0.2176622 0.1468091 0.1954579 -0.4923836 -0.9903159 0.4487517 -0.3365503 0.4043086 -0.6331392 0.1145742 -0.291422 0.1043677 -0.4734544 -0.6811153 -0.0685334 0.1587571 0.108136 -0.6206181 0.3030846 -0.0250705 0.3439648 -0.6548836 -0.6326176 0.0332208 0.0439736 -0.0219923 -0.5134451 0.2293419 0.0965283 0.2189175 -0.5049333 0.0160213 0.0261729 0.0077566 0.0231817 0.1129556 0.045998 0.0077094 0.0453205 0.1185459 0.0529065 0.0137486 0.0109778 0.0311865 0.1067078 0.04955 -0.0051017 0.0538629 0.1084097 -0.4295068 -0.0336695 0.1542552 -0.1730964 0.0186872 0.1283943 0.2956838 0.0970734 -0.050761 -0.2797209 -0.0141862 0.1136327 -0.1420328 0.0625419 0.1248803 0.2415473 0.0953339 -0.0004619 0.8770798 0.0124188 -0.1784193 0.1340092 0.3731471 -0.2579129 -0.2969501 -0.2298443 0.4315821 1.4653054 -0.2761919 -0.0084762 -0.3257082 0.8211145 -0.5839764 0.0455042 -0.5955514 0.7915294 0.9017308 0.0339799 -0.1908594 0.0507015 0.4334513 -0.2893897 -0.2065976 -0.2877669 0.4554389 -0.4888816 -0.0904998 0.1870249 -0.12487 -0.0623185 0.0847531 0.2150003 0.0770573 -0.1186092 0.0419037 -0.0299822 -0.0001126 -0.0256283 -0.1378441 -0.0249959 -0.0100757 -0.0272111 0.0666419 0.0439804 -0.0007724 -0.0194436 0.0082147 0.0645322 -0.0305454 -0.0213039 -0.025396 -0.1411533 0.0484907 -0.0217664 -0.006125 -0.0288363 -0.1384461 -0.0225517 -0.0158829 -0.0269565 0.0694829 0.054518 0.0032772 -0.0280553 0.0121601 0.0650333 -0.0301645 -0.0208783 -0.0255488 -0.1370387 0.0670061 -0.0038518 -0.0139831 0.0357 0.1050925 -0.0386228 -0.0778466 -0.0125846 -0.0499046 0.0738479 -0.0216236 0.0065574 0.0438826 -0.0604218 -0.0288296 -0.0358685 -0.0308975 0.112099 0.0643548 -0.0320869 0.0089026 0.0128694 -0.083008 -0.0164217 -0.0199291 -0.029716 0.1073827 0.0629069 -0.002076 -0.0103748 0.0222051 0.1034714 -0.0390872 -0.0497485 -0.010005 -0.0780509 0.1091593 -0.0044778 0.0174238 -0.0153096 -0.0391666 -0.0506978 -0.020793 -0.0456282 0.1295834 0.1053315 -0.0195417 -0.0392217 0.0187877 0.1368247 -0.0326753 -0.0247627 -0.0321006 -0.03905 -0.031973 0.0643657 -0.025927 0.1001506 0.0458987 0.050176 -0.0584869 0.0586466 0.0815673 0.199984 -0.0484428 0.0948717 -0.0844661 0.3165283 0.0974562 0.1319356 0.0892045 0.2684213 unknown
polarizability: 121.3078955|-6.2753509|82.8948509|-6.5711386|-17.5906363|82.5087821 unknown
InChI: InChI=1S/C8H12O4/c1-6(9)7(10)4-2-3-5-8(11)12/h11H,2-5H2,1H3
charge 0 multiplicity 1
24 atoms
O  -2.304527 -0.485841 1.231747
O  5.248345 -1.085076 0.166457
O  4.463302 0.519409 -1.316562
O  -3.162289 2.087492 -1.059886
C  0.383568 -0.128956 0.302765
C  1.734687 0.221312 -0.35572
C  -0.771706 0.709237 -0.271221
C  2.887312 -0.618532 0.22581
C  -2.12172 0.388147 0.342484
C  4.228975 -0.305487 -0.406916
C  -3.342047 1.205202 -0.17914
C  -4.68846 0.872157 0.423398
H  0.159222 -1.204619 0.163956
H  0.440778 0.028415 1.397632
H  1.959695 1.296429 -0.218077
H  1.679918 0.05964 -1.449423
H  -0.859374 0.582154 -1.370606
H  -0.588637 1.796597 -0.145091
H  2.696562 -1.702149 0.096003
H  2.983422 -0.464626 1.318612
H  -4.932359 -0.191545 0.245248
H  -4.654825 0.990667 1.521927
H  -5.467399 1.518177 -0.007971
H  6.115256 -0.859604 -0.268825
