program: Gaussian 09
title: 000273394
version: EM64L-G09RevD.01
frameworkgroup: C1[X(C16H16O5)]
method: RPBEPBE
basis: SDD
operation: Freq
keyword: #pfreq=noraman
keyword: PBEPBE/SDD
title: #p freq=noraman PBEPBE/SDD
converged: YES YES NO NO
title: Mulliken charges:
elementType: O O O O O C C C C C C C C C C C C C C C C H H H H H H H H H H H H H H H H
charge: -0.271318 -0.453443 -0.214148 -0.472651 -0.251561 -0.191665 -0.234728 -0.279155 -0.128172 -0.506440 0.047486 0.232907 0.197278 -0.213192 -0.167157 0.175250 -0.423043 -0.410335 -0.201713 0.309626 -0.758318 0.272655 0.283369 0.237204 0.255998 0.259861 0.224896 0.245729 0.207216 0.367295 0.283014 0.225824 0.235360 0.369442 0.251372 0.253312 0.241946
chargesum: 0.00000
title: Mulliken charges with hydrogens summed into heavy atoms:
elementType: O O O O O C C C C C C C C C C C C C C C C
charge: -0.271318 -0.086148 -0.214148 -0.103209 -0.251561 0.080990 0.048641 -0.041951 0.127826 -0.021683 0.047486 0.232907 0.197278 0.032537 0.040059 0.175250 -0.140029 -0.184512 0.033647 0.309626 -0.011689
chargesum: 0.00012
polarizability: 2.02952785e+02 2.67391480e+01 1.62621757e+02 2.64156654e+00 -7.08483960e+00 1.73012009e+02
1716.lowfreq: -14.0193 -5.2809 -1.5930 -0.0070 -0.0004 1.7994 25.5822 35.8801 47.5415
frequency: 25.4531 35.8287 47.5284 66.0649 69.4425 82.2940 100.4621 120.4666 156.2200 186.4795 193.4140 216.1475 252.0160 262.3894 292.1425 310.0181 350.8670 360.4616 373.0974 383.0061 407.4702 448.8759 461.3427 490.3396 505.8010 516.6688 534.8169 555.9457 565.1511 581.2795 595.8330 614.5819 645.1150 672.0696 731.4443 739.4286 758.7134 779.0066 803.1169 824.2189 869.8309 881.0390 894.5717 899.9980 903.7330 932.5852 950.6095 974.4713 985.4942 990.4982 995.8819 1001.4843 1041.0856 1042.5721 1056.3107 1077.0794 1106.9926 1113.5374 1150.7283 1169.6547 1189.4229 1194.1959 1198.8096 1202.9506 1213.5898 1235.4663 1254.6271 1259.7042 1272.2069 1300.3264 1316.2452 1320.7494 1341.6667 1350.1768 1360.7188 1375.8338 1379.6379 1383.4579 1400.5698 1439.3515 1453.1982 1453.4781 1455.3365 1475.7857 1582.5913 1601.4076 1621.3035 1641.9778 1674.1553 2959.5578 2970.7138 2975.9452 3004.7635 3009.5348 3022.7365 3023.3276 3097.6133 3106.9508 3118.3147 3137.0868 3149.1367 3150.5870 3169.6086 3529.1181 3594.1038
redmass: 6.1949 5.0913 4.7700 4.7514 1.1254 4.7636 4.7056 4.7797 5.0037 5.9169 6.1717 5.0047 4.0291 4.1870 4.0440 4.7154 1.5923 2.4559 3.5450 4.9274 5.9896 3.9988 1.1806 3.1026 4.4057 5.2006 4.0005 5.4104 3.8689 3.9971 4.5502 3.9743 4.6770 5.6464 1.8400 2.9846 2.8792 3.2526 2.2884 4.7724 5.6854 4.7372 4.1450 1.4842 2.8447 4.1469 4.4537 2.0544 1.3966 2.1249 1.7613 2.1155 2.6439 1.6921 2.1538 1.7774 1.6332 1.7571 1.2554 1.0938 1.2364 2.2105 2.3394 1.2362 1.2141 2.0232 1.4183 2.1860 1.7097 1.3503 1.4184 1.4626 1.7448 1.6040 1.7970 1.8476 1.6704 1.2410 5.2035 1.0932 1.1819 2.1290 1.0548 3.1701 8.7344 7.9835 8.1344 9.6522 6.5582 1.0761 1.0837 1.0676 1.0376 1.0833 1.0872 1.0945 1.0950 1.0868 1.0893 1.1024 1.0904 1.0973 1.0979 1.0657 1.0662
irintensity: 1.1013 0.7655 2.9089 1.5952 0.5147 1.2127 1.1032 4.8702 3.2390 5.3084 1.1046 0.3121 0.5090 5.6677 12.4878 3.9372 91.2707 24.8233 5.6996 12.5337 9.3647 7.7891 143.0292 2.5207 10.6688 8.5603 0.2580 9.7258 3.5636 7.3073 2.4249 7.5494 8.1912 4.6691 23.2601 24.6391 17.4700 47.0178 22.6814 20.8972 35.1525 66.2493 45.8000 8.3014 14.7649 60.3898 21.9517 17.3446 3.9840 51.1853 36.0128 29.9132 14.0374 13.6635 21.4769 13.4186 17.8097 4.6449 68.9346 3.2309 39.6600 126.9177 277.7025 23.7205 37.1054 63.6769 15.3477 99.8916 2.6585 30.9077 38.9653 8.6531 8.2393 0.3164 4.8674 27.5160 16.3031 42.9834 3.6383 32.7899 24.0252 8.4750 12.9482 2.1604 151.9742 13.0293 10.3990 225.0578 5.4763 24.2072 29.5313 28.6692 2.3356 3.3564 11.1854 10.5570 7.0568 20.1050 12.0259 10.8943 8.1894 24.3531 14.4502 16.4401 40.9422
temp: 298.150 k
press: 1.00000 atm
elementType: 8 8 8 8 8 6 6 6 6 6 6 6 6 6 6 6 6 6 6 6 6 1 1 1 1 1 1 1 1 1 1 1 1 1 1 1 1
symmnumber: 1
zpe: 754372.4 jmol-1
zpe.correction: 0.287325 hartree
zpe.thermalcorrener: 0.306396 hartree
zpe.thermalcorrenthalpy: 0.307340 hartree
zpe.thermalcorrgfe: 0.239063 hartree
zpe.sumelectzpe: -993.885537 hartree
zpe.sumelectthermal: -993.866467 hartree
zpe.sumelectthermalent: -993.865523 hartree
zpe.sumelectthermalfe: -993.933800 hartree
dipole: 4.7149 0.9893 -0.6462
dipole: 4.8607
quadrupole: -100.6784 -124.5133 -126.2052
quadrupole: 15.4832 -4.1316 5.0242
quadrupole: 16.4539 -7.3810 -9.0729 15.4832 -4.1316 5.0242
hfenergy: -994.1728627 hartree
pointgroup: C01 [X(C16H16O5)]
dipole: 1.8199118 -0.5160387 0.2805655 debye
polarizability: 199.8483485|-28.4878054|166.9036991|-3.9938996|-8.2102815|171.8345024 unknown
InChI: InChI=1S/C16H16O5/c1-8(17)21-12-7-3-5-10-14(12)16(20)13-9(15(10)19)4-2-6-11(13)18/h2-4,6-7,10,12,14,16,18,20H,5H2,1H3
charge 0 multiplicity 1
37 atoms
O  -1.221227 -1.197086 -0.148428
O  1.068947 1.230004 2.624074
O  -0.37091 1.646048 -2.29245
O  2.973499 -0.935038 2.050435
O  -2.616088 -2.954753 0.492568
C  -0.866003 0.805348 1.238579
C  -0.772129 1.879737 0.1219
C  0.518753 0.262932 1.639648
C  -1.874881 -0.304083 0.89472
C  -2.14909 2.4888 -0.220503
C  -0.026461 1.350295 -1.112957
C  1.486741 0.090907 0.475516
C  1.217306 0.558846 -0.836304
C  -3.176509 0.233971 0.352053
C  -3.288067 1.494082 -0.142696
C  2.721829 -0.562825 0.707797
C  2.133446 0.319447 -1.892895
C  3.642654 -0.807489 -0.332485
C  3.33491 -0.369485 -1.642917
C  -1.717491 -2.500209 -0.252826
C  -1.034459 -3.237172 -1.384848
H  -1.263514 1.30131 2.145335
H  -0.111446 2.678662 0.523764
H  0.400671 -0.719263 2.143036
H  -2.06216 -0.950407 1.773421
H  -2.105347 2.907247 -1.245011
H  -2.367206 3.339801 0.456875
H  -4.033652 -0.448429 0.367315
H  -4.263867 1.838848 -0.512395
H  1.912995 0.836491 2.970252
H  1.880166 0.689704 -2.8909
H  4.588358 -1.326645 -0.129582
H  4.044869 -0.556597 -2.455172
H  3.824087 -1.43119 2.135823
H  0.012786 -2.912932 -1.491176
H  -1.555082 -3.007019 -2.332473
H  -1.090727 -4.322255 -1.209992
