program: Gaussian 09
title: 000273385
version: EM64L-G09RevD.01
frameworkgroup: C1[X(C16H14O5)]
method: RPBEPBE
basis: SDD
operation: Freq
keyword: #pfreq=noraman
keyword: PBEPBE/SDD
title: #p freq=noraman PBEPBE/SDD
converged: YES YES NO NO
title: Mulliken charges:
elementType: O O O O O C C C C C C C C C C C C C C C C H H H H H H H H H H H H H H
charge: -0.270750 -0.160484 -0.199571 -0.380232 -0.251708 -0.307763 -0.235808 -0.075664 -0.487024 0.030201 -0.000351 -0.244527 0.143126 0.231373 -0.165583 0.196818 -0.407182 -0.416171 -0.195656 0.320012 -0.763879 0.294832 0.269923 0.273780 0.229632 0.260263 0.234416 0.209862 0.287696 0.227026 0.238977 0.360638 0.265884 0.247171 0.240722
chargesum: 0.00000
title: Mulliken charges with hydrogens summed into heavy atoms:
elementType: O O O O O C C C C C C C C C C C C C C C C
charge: -0.270750 -0.160484 -0.199571 -0.019593 -0.251708 -0.012931 0.034115 0.198117 0.002872 0.030201 -0.000351 -0.010112 0.143126 0.231373 0.044279 0.196818 -0.119486 -0.189144 0.043321 0.320012 -0.010103
polarizability: 2.08390623e+02 2.09773499e+01 2.11391650e+02 -2.28611661e+01 1.39102542e+01 1.29643462e+02
1716.lowfreq: -12.6018 -9.5046 -5.0992 -0.0008 -0.0007 -0.0005 36.7386 39.7629 50.8513
frequency: 36.6747 39.7383 50.8472 57.3061 74.4365 90.6917 93.0708 127.0210 163.8303 187.4029 214.3516 246.6263 251.9621 275.7291 324.9025 328.6929 345.6071 379.0638 386.6648 402.4858 433.9573 442.8236 471.6875 479.4571 500.9364 529.2586 560.3641 570.1106 590.0798 602.9457 625.7519 652.4911 670.2899 695.4215 741.1868 763.2475 775.7058 813.2465 825.3425 860.2015 879.2413 906.1965 909.1919 923.8914 948.4796 970.8547 987.2883 992.5779 993.0569 1006.8148 1043.8627 1044.8559 1079.1632 1086.2741 1099.4303 1103.6635 1160.7405 1183.0367 1185.7205 1195.4760 1207.7381 1225.4737 1240.0709 1243.8885 1263.5887 1273.5770 1284.3005 1304.6355 1337.4853 1343.2787 1350.1036 1376.1097 1383.7132 1396.1713 1437.8215 1447.2858 1453.6564 1454.3962 1466.5055 1570.9870 1573.5136 1603.2449 1615.2318 1644.6430 1677.2911 2954.2125 2979.9233 2988.4771 3006.8688 3029.3427 3046.6963 3101.0899 3114.6486 3116.4428 3140.9212 3145.5727 3152.1458 3173.5040 3548.7311
redmass: 6.8517 5.6567 4.3027 9.2022 5.8570 1.0530 4.5702 6.4372 4.9370 5.1935 4.0608 4.4433 4.9614 5.5214 3.8665 5.3738 3.7973 4.3904 1.6227 3.3871 6.0816 4.2233 5.6630 4.0381 4.6048 4.4084 3.9473 4.2160 5.2301 4.5825 4.2349 4.8043 3.7419 1.7182 3.9536 4.7193 2.2820 2.6987 4.4307 4.8987 5.8166 3.6511 1.4237 2.1460 4.8877 1.4115 2.2852 1.6484 2.0223 2.5571 1.6658 4.3309 2.3512 1.8458 1.9807 1.9538 1.3560 1.2568 1.2721 2.3544 1.1974 1.8256 1.5627 2.0014 2.3696 1.5358 2.8451 1.3173 1.8961 1.4662 1.4375 1.6395 1.2627 8.0673 2.6355 1.0974 1.0556 1.0579 2.9786 8.0046 7.4324 8.5780 8.6619 9.7527 6.9992 1.0794 1.0644 1.0828 1.0379 1.0972 1.0852 1.0945 1.0851 1.0895 1.1025 1.0989 1.0910 1.0973 1.0659
irintensity: 8.4838 0.4637 4.1630 0.4464 1.6911 0.2978 2.4758 0.9363 2.4247 1.5516 5.6715 1.7649 6.7614 1.7010 5.6121 4.4800 3.8339 42.1757 84.2110 12.0664 2.5833 6.7612 0.6121 6.3898 1.3100 9.5981 4.6439 3.0836 5.3883 8.4304 13.2449 15.3197 4.9453 32.1202 11.2583 1.8574 37.2123 30.7576 4.3202 3.2034 66.8905 2.4487 2.9883 22.8800 56.8520 5.6410 12.2802 37.4887 71.7938 1.8616 7.4402 9.5109 22.3615 6.4674 24.7507 5.5488 91.1040 32.7442 12.6943 216.8839 7.3374 169.2608 7.8628 68.9620 139.7323 50.4824 11.0041 4.6693 31.4910 2.3856 2.7695 7.4567 58.0203 6.9111 9.8782 30.2579 20.6727 22.2570 7.9365 84.3296 160.5340 39.6694 96.6994 167.6235 8.5607 15.9341 34.5008 11.5088 1.6557 2.8123 8.1566 8.7073 8.9885 11.3950 7.8203 31.9498 9.6447 11.1167 35.9640
temp: 298.150 k
press: 1.00000 atm
elementType: 8 8 8 8 8 6 6 6 6 6 6 6 6 6 6 6 6 6 6 6 6 1 1 1 1 1 1 1 1 1 1 1 1 1 1
symmnumber: 1
zpe: 694161.4 jmol-1
zpe.correction: 0.264392 hartree
zpe.thermalcorrener: 0.282873 hartree
zpe.thermalcorrenthalpy: 0.283817 hartree
zpe.thermalcorrgfe: 0.217011 hartree
zpe.sumelectzpe: -992.707985 hartree
zpe.sumelectthermal: -992.689504 hartree
zpe.sumelectthermalent: -992.688560 hartree
zpe.sumelectthermalfe: -992.755367 hartree
dipole: 1.4365 0.7345 -0.8337
dipole: 1.8161
quadrupole: -95.0565 -118.9730 -127.4017
quadrupole: 4.9869 -3.5181 -7.9365
quadrupole: 18.7539 -5.1626 -13.5913 4.9869 -3.5181 -7.9365
hfenergy: -992.9723774 hartree
pointgroup: C01 [X(C16H14O5)]
dipole: 0.3751507 -0.435524 0.4243619 debye
polarizability: 187.4206849|-10.6077377|225.0646383|34.4064333|-7.3119402|136.9404123 unknown
InChI: InChI=1S/C16H14O5/c1-8(17)21-12-7-3-5-10-14(12)16(20)13-9(15(10)19)4-2-6-11(13)18/h2-4,6-7,10,12,14,18H,5H2,1H3
charge 0 multiplicity 1
35 atoms
O  -2.692667 -0.668202 0.081692
O  -0.133031 -1.617269 -2.023246
O  1.28385 3.056551 0.377562
O  1.634797 -2.983265 -0.429907
O  -1.254018 -1.985447 1.371513
C  -0.888541 0.511508 -1.127983
C  -0.123438 1.862079 -1.23186
C  -1.731444 0.481318 0.176066
C  -1.077536 3.077133 -1.226416
C  0.086703 -0.667023 -1.221539
C  0.965768 1.952703 -0.151149
C  -2.556171 1.733191 0.338271
C  1.28022 -0.585665 -0.323116
C  1.679173 0.681556 0.21825
C  -2.258854 2.89687 -0.293336
C  2.022682 -1.742785 0.063982
C  2.781072 0.785908 1.099177
C  3.120676 -1.626905 0.954265
C  3.497647 -0.369713 1.466473
C  -2.302513 -1.869815 0.697078
C  -3.30198 -2.96172 0.400072
H  -1.591858 0.423365 -1.97542
H  0.428909 1.846815 -2.197183
H  -1.091628 0.290162 1.061236
H  -1.448509 3.271888 -2.252918
H  -0.501024 3.972199 -0.922881
H  -3.413634 1.659007 1.017616
H  -2.894003 3.776725 -0.1266
H  3.050938 1.776445 1.476092
H  3.676409 -2.527386 1.247309
H  4.350779 -0.297739 2.148898
H  2.140175 -3.710091 0.016369
H  -3.052413 -3.411791 -0.578351
H  -4.323854 -2.556778 0.335593
H  -3.240978 -3.74423 1.171091
