program: Gaussian 09
title: 000273365
version: EM64L-G09RevD.01
frameworkgroup: C1[X(C13H17N3O5)]
method: RPBEPBE
basis: SDD
operation: Freq
keyword: #p
keyword: freq=noraman
keyword: PBEPBE/SDD
title: #p freq=noraman PBEPBE/SDD
converged: YES YES NO NO
title: Mulliken charges:
elementType: O O O O O N N N C C C C C C C C C C C C C H H H H H H H H H H H H H H H H H
charge: -0.281799 -0.443012 -0.258113 -0.321784 -0.286592 -0.373639 -0.338796 -0.599451 -0.196815 -0.360613 0.203380 0.302538 -0.497606 -0.477372 0.473735 -0.390336 -0.368660 0.282864 -0.225581 -0.226387 -0.233504 0.258993 0.265697 0.160888 0.364433 0.315259 0.294404 0.254351 0.217754 0.240573 0.231580 0.271657 0.384110 0.224722 0.225556 0.227041 0.350578 0.329945
chargesum: 0.00000
title: Mulliken charges with hydrogens summed into heavy atoms:
elementType: O O O O O N N N C C C C C C C C C C C C C
charge: -0.281799 -0.058902 -0.258113 -0.321784 -0.286592 -0.009206 -0.023537 0.081072 0.062178 0.065972 0.203380 0.302538 0.051148 -0.019044 0.473735 -0.158756 -0.097002 0.282864 -0.000859 -0.000831 -0.006463
polarizability: 2.25854869e+02 1.96436090e+01 1.50156033e+02 -8.10020532e+00 9.54350388e+00 1.50988081e+02
1716.lowfreq: -3.8495 -3.1657 -0.0006 -0.0006 -0.0003 8.8631 13.7154 20.8061 23.7357
frequency: 13.6722 20.5323 23.7057 36.1442 48.5438 59.9391 72.6449 84.3048 101.9946 115.9135 151.3909 158.4910 200.9105 207.1364 235.8741 255.4789 279.6994 308.4593 319.6629 342.9953 383.2410 404.0890 439.1756 460.8575 486.2598 516.1202 545.7710 560.4731 570.0063 596.2072 611.2794 617.9985 619.6470 636.8589 654.3875 673.5346 699.1762 704.1956 706.8486 758.0816 768.0370 809.3187 815.5127 825.9089 857.5379 867.1709 893.5660 934.4048 968.1963 980.9571 986.6656 989.6192 997.7688 999.6009 1020.7361 1027.7644 1037.7025 1063.9973 1089.5074 1091.3469 1152.3132 1172.5211 1175.5892 1188.3032 1217.9389 1219.7236 1221.9485 1240.8922 1245.2845 1261.2595 1298.3218 1329.6573 1330.7142 1354.4352 1366.4010 1370.8393 1386.1964 1394.7183 1428.3460 1442.3274 1460.7678 1463.3784 1476.2673 1485.2768 1501.4520 1594.9243 1597.6263 1615.3812 1625.1465 1644.4448 1651.9130 2906.2803 2985.2135 3004.2465 3032.3300 3067.1540 3085.1970 3105.6119 3118.4080 3126.6721 3139.2678 3150.5919 3164.0286 3333.1399 3515.6494 3528.8162 3545.4694 3665.5836
redmass: 5.9391 4.4093 5.0608 4.3584 6.9033 6.6158 6.4046 10.3217 4.6725 7.3196 5.9798 6.2754 4.9997 3.8384 5.3663 5.1903 4.1965 5.2345 3.7318 2.5894 2.7858 2.8164 3.0508 1.6327 3.7557 5.1867 1.2787 2.9719 2.2884 3.5342 1.6952 4.8532 1.7691 1.8146 2.8738 2.5510 5.2485 1.5997 1.5177 2.1398 5.3253 3.4459 3.4813 4.1791 1.2494 3.6473 3.6721 1.5073 2.0512 1.4438 2.1946 4.3001 3.4462 1.4055 3.4910 2.2063 3.1436 2.0809 2.2487 2.0567 2.0324 1.0540 1.4120 1.1186 2.1657 1.6347 2.6552 1.1605 1.4000 1.3708 1.4408 1.2583 1.4048 1.3410 2.6394 1.3270 7.9305 1.1703 1.1189 2.1845 1.1557 1.0935 2.0110 2.2860 1.9314 6.1179 1.5766 6.1082 6.2790 8.0142 3.3148 1.0706 1.0829 1.0590 1.0586 1.1026 1.0916 1.1071 1.0864 1.0874 1.0921 1.0963 1.1016 1.0689 1.0452 1.0775 1.0776 1.1045
irintensity: 2.0335 0.8457 3.5017 1.4613 1.1908 6.3442 0.2981 9.4847 11.3483 7.0431 3.2833 1.1820 4.4093 1.6387 4.3893 26.4863 8.2825 15.7786 3.5910 10.9398 17.6988 0.0890 22.4454 6.9481 0.8059 14.7603 132.2715 24.5941 51.5552 12.2719 172.0549 4.3601 11.9366 81.3775 77.1784 8.4709 14.1475 64.1497 160.2179 54.5793 3.1695 11.1846 8.4196 20.7775 0.3368 6.2811 48.9478 5.0424 39.8769 9.7362 116.7426 3.5624 156.9596 19.8989 36.8475 2.8769 14.3174 0.8481 14.2591 28.0315 64.3968 0.0730 27.9621 2.4623 100.4433 32.6622 14.8092 14.3416 89.9984 63.6226 33.6301 1.6751 71.4249 4.3002 79.5985 52.4258 0.5746 39.3126 36.9160 9.9018 16.1690 10.4960 720.7534 59.4680 24.5590 3.1113 46.1416 1.7878 270.1188 119.6895 422.8039 85.1406 35.9076 41.1588 39.4902 3.3179 27.1906 6.7395 5.5054 2.4242 21.8324 26.2098 23.8417 498.6920 52.3820 112.6173 19.7291 34.8750
temp: 298.150 k
press: 1.00000 atm
elementType: 8 8 8 8 8 7 7 7 6 6 6 6 6 6 6 6 6 6 6 6 6 1 1 1 1 1 1 1 1 1 1 1 1 1 1 1 1 1
symmnumber: 1
zpe: 784122.2 jmol-1
zpe.correction: 0.298656 hartree
zpe.thermalcorrener: 0.319520 hartree
zpe.thermalcorrenthalpy: 0.320464 hartree
zpe.thermalcorrgfe: 0.244768 hartree
zpe.sumelectzpe: -1044.420995 hartree
zpe.sumelectthermal: -1044.400132 hartree
zpe.sumelectthermalent: -1044.399188 hartree
zpe.sumelectthermalfe: -1044.474884 hartree
dipole: -8.0198 -1.2207 0.5742
dipole: 8.1324
quadrupole: -50.3765 -127.7268 -120.8421
quadrupole: 4.4813 -4.1368 -0.2975
quadrupole: 49.2719 -28.0783 -21.1936 4.4813 -4.1368 -0.2975
hfenergy: -1044.7196517 hartree
pointgroup: C01 [X(C13H17N3O5)]
dipole: -3.1267439 0.3130709 0.6021146 debye
polarizability: 223.6719583|-10.9947142|150.3714092|-22.481266|-8.691231|152.9556164 unknown
InChI: InChI=1S/C13H17N3O5/c14-11(18)6-15-12(19)10(7-17)16-13(20)21-8-9-4-2-1-3-5-9/h1-5,10,15-17H,6-8,14H2
charge 0 multiplicity 1
38 atoms
O  1.917301 -0.630037 1.555349
O  -1.856634 0.131077 -1.626139
O  -2.656938 -1.213645 1.526766
O  1.325224 1.620926 1.119933
O  -4.673098 -0.213855 -1.442867
N  -0.244806 -0.113094 1.078989
N  -3.830012 0.728278 1.019722
N  -6.734013 -0.893813 -0.639718
C  -1.375286 0.756222 0.779972
C  -1.442572 1.189283 -0.731731
C  -2.656833 -0.001509 1.161859
C  1.014927 0.39905 1.231184
C  -5.112844 0.042492 0.978422
C  3.350618 -0.206459 1.691408
C  4.097055 -0.314827 0.378655
C  4.826522 -1.487767 0.059835
C  4.075262 0.759555 -0.549048
C  -5.477659 -0.36085 -0.474377
C  5.520723 -1.59162 -1.166513
C  4.76705 0.656123 -1.775714
C  5.491947 -0.518564 -2.087234
H  -1.277074 1.686887 1.376186
H  -0.422866 1.479476 -1.03191
H  -2.093172 2.091809 -0.817914
H  -0.429681 -1.112409 1.203324
H  -3.772676 1.670505 0.628504
H  -5.014956 -0.875656 1.587103
H  -5.910662 0.670645 1.414642
H  3.744907 -0.907158 2.444451
H  3.361127 0.826695 2.079979
H  4.845335 -2.322203 0.771961
H  3.501907 1.660893 -0.304262
H  -2.848559 -0.009056 -1.576434
H  6.081316 -2.502974 -1.403302
H  4.74266 1.488956 -2.487513
H  6.029295 -0.597329 -3.039239
H  -7.014188 -1.209051 -1.568916
H  -7.373644 -1.030197 0.141789
