program: Gaussian 09
title: 000273340
version: EM64L-G09RevD.01
frameworkgroup: C1[X(C10H15N5O4)]
method: RPBEPBE
basis: SDD
operation: Freq
keyword: #p
keyword: freq=noraman
keyword: PBEPBE/SDD
title: #p freq=noraman PBEPBE/SDD
converged: YES YES NO NO
title: Mulliken charges:
elementType: O O O O N N N N N C C C C C C C C C C H H H H H H H H H H H H H H H
charge: -0.277241 -0.329091 -0.450999 -0.206277 -0.356471 -0.604080 -0.458209 -0.082359 -0.368461 -0.187779 -0.549143 0.388852 0.225984 -0.514143 -0.476725 0.343950 -0.261558 -0.391722 0.189854 0.240450 0.237570 0.223554 0.339470 0.255189 0.253071 0.312674 0.266668 0.387257 0.257857 0.254463 0.364092 0.283369 0.289449 0.400487
chargesum: 0.00000
title: Mulliken charges with hydrogens summed into heavy atoms:
elementType: O O O O N N N N N C C C C C C C C C C
charge: -0.277241 -0.329091 -0.050512 -0.206277 -0.017001 -0.024738 -0.070952 -0.082359 -0.004369 0.052672 -0.088020 0.388852 0.225984 -0.005883 -0.218868 0.343950 -0.007095 0.181095 0.189854
polarizability: 1.92803549e+02 -6.76292965e+00 1.51972997e+02 -3.94925648e-01 -6.52012021e+00 1.12738715e+02
1716.lowfreq: -5.5216 0.0007 0.0008 0.0010 1.4722 7.6856 18.3160 33.5329 47.2769
frequency: 18.2547 33.4396 47.2762 49.8975 61.4313 74.2407 98.9156 102.0717 117.7663 132.8843 172.9048 184.0535 232.8520 257.3299 282.0286 306.2742 308.8049 323.6443 326.2230 362.9358 378.3494 462.8794 492.3512 524.6027 542.3986 546.7305 554.8712 569.7023 636.2410 638.1780 652.7046 655.9500 657.6994 705.0127 738.1404 745.6268 784.3593 812.7268 817.6349 825.1606 896.9221 910.7544 935.9111 952.8716 967.9820 978.2244 1004.6516 1009.8845 1064.6069 1080.0435 1104.0895 1115.0630 1120.3547 1135.5162 1153.9740 1180.4609 1215.2511 1223.5137 1233.8366 1244.8026 1246.7014 1263.8152 1282.8907 1295.7392 1305.1284 1329.4684 1355.3513 1356.2376 1384.6655 1407.1991 1428.5697 1440.9581 1455.1917 1456.5701 1498.0785 1505.1766 1565.9652 1580.9724 1613.4482 1638.9828 1689.8044 2967.6949 2992.0720 2997.1472 3009.3429 3045.6520 3054.0351 3075.6606 3213.4513 3215.0245 3236.0430 3472.0032 3537.8182 3541.8530 3552.8403 3616.4838
redmass: 6.5124 5.5607 8.8996 3.7949 6.4891 6.0200 5.8176 7.3877 5.0676 5.4467 3.2012 3.9344 4.0397 3.5656 2.4788 5.4538 1.6867 2.6473 3.1129 4.7318 3.6952 5.2785 1.9235 3.5158 1.3511 3.1484 1.4826 3.0048 1.2593 3.3741 2.8145 1.5318 3.6345 4.2704 5.0291 4.7435 1.4113 2.1537 2.7714 2.4403 5.7249 2.4366 4.9061 2.7715 1.8852 2.0343 1.9506 2.5274 4.7848 2.0263 2.4877 3.4503 1.4366 1.5385 1.7505 2.2246 1.0887 1.6161 1.6741 2.2094 1.8980 1.3635 1.3477 1.2568 2.2871 1.4251 4.2096 1.5031 1.5940 2.1433 1.1259 1.9004 1.0761 1.3106 2.0195 2.1946 2.6702 2.1030 6.9740 1.7030 9.3805 1.0840 1.0610 1.0628 1.0601 1.0972 1.1030 1.1024 1.0921 1.0981 1.1001 1.0455 1.0648 1.0782 1.0793 1.0985
irintensity: 0.1286 2.8204 4.4855 2.3777 11.4620 1.0288 2.0738 4.6987 2.2050 3.6193 0.8048 10.6296 3.7737 6.3087 23.9129 4.9931 50.5142 2.7841 14.4373 15.6505 6.4575 22.8831 41.0016 42.6742 52.3543 36.7332 364.6749 18.6946 7.4494 3.0421 29.5826 221.7085 27.3969 1.4922 12.1007 5.7943 45.4920 4.0841 39.1897 3.5762 33.4624 11.5659 13.2264 29.5039 54.6791 2.1569 59.1819 9.8189 7.0417 256.6862 20.1952 7.5598 1.4788 15.7771 1.7923 20.5343 0.5459 48.7475 2.7117 5.9963 17.3199 13.9393 2.2948 3.3719 48.4381 10.1671 0.4645 20.0543 8.6672 19.9971 11.9561 8.6400 15.7229 9.3259 168.7479 333.5105 20.5062 233.7796 304.1750 23.2600 271.9188 25.6748 39.3785 20.7851 25.5195 3.4505 17.4424 6.9742 951.7778 99.1004 17.4536 17.7847 25.6101 106.8946 32.8973 13.8043
temp: 298.150 k
press: 1.00000 atm
elementType: 8 8 8 8 7 7 7 7 7 6 6 6 6 6 6 6 6 6 6 1 1 1 1 1 1 1 1 1 1 1 1 1 1 1
symmnumber: 1
zpe: 696174.6 jmol-1
zpe.correction: 0.265159 hartree
zpe.thermalcorrener: 0.284255 hartree
zpe.thermalcorrenthalpy: 0.285199 hartree
zpe.thermalcorrgfe: 0.215244 hartree
zpe.sumelectzpe: -963.310220 hartree
zpe.sumelectthermal: -963.291124 hartree
zpe.sumelectthermalent: -963.290180 hartree
zpe.sumelectthermalfe: -963.360134 hartree
dipole: -5.3771 2.3646 2.5872
dipole: 6.4186
quadrupole: -115.0235 -127.7318 -106.2580
quadrupole: 10.1314 -16.6570 -5.0310
quadrupole: 1.3143 -11.3941 10.0798 10.1314 -16.6570 -5.0310
hfenergy: -963.5753786 hartree
pointgroup: C01 [X(C10H15N5O4)]
dipole: -1.8798314 -1.6847643 -0.0690771 debye
polarizability: 185.853796|11.4701558|142.9141322|-12.1358545|-22.9802438|128.747332 unknown
InChI: InChI=1S/C10H15N5O4/c11-7(1-6-2-12-5-15-6)10(19)14-3-8(16)13-4-9(17)18/h2,5,7,13-15,17H,1,3-4,11H2
charge 0 multiplicity 1
34 atoms
O  0.617341 -2.055895 1.066486
O  -0.959545 0.812479 -0.119086
O  -4.874806 -1.850268 0.864165
O  -5.660115 0.0306 1.991336
N  0.790905 -1.263009 -1.096814
N  3.336322 -2.190239 1.332583
N  1.587315 1.774089 -0.830886
N  3.155047 2.742315 -2.155313
N  -2.627906 -0.767381 0.081421
C  2.830991 -1.270245 0.318491
C  2.99978 0.26369 0.706705
C  2.824331 1.253532 -0.411878
C  1.337549 -1.580012 0.131987
C  -0.654951 -1.353188 -1.283912
C  3.772292 1.870186 -1.24548
C  -1.41126 -0.35096 -0.380919
C  1.835681 2.656871 -1.872992
C  -3.446015 0.102887 0.930164
C  -4.768367 -0.528611 1.327361
H  3.363546 -1.41819 -0.643335
H  2.322619 0.477152 1.556165
H  4.033696 0.364606 1.086369
H  1.367418 -0.796797 -1.799373
H  -0.889874 -1.122349 -2.338295
H  -0.997083 -2.381488 -1.066588
H  2.624626 -2.480365 2.010507
H  4.247232 -1.958089 1.730955
H  0.648823 1.494131 -0.477896
H  4.854241 1.748796 -1.23122
H  1.049546 3.211286 -2.380357
H  -2.946382 -1.731011 -0.046559
H  -3.655169 1.06213 0.421192
H  -2.90182 0.371452 1.857248
H  -5.739405 -2.247407 1.152766
