program: Gaussian 09
title: 000273301
version: EM64L-G09RevD.01
frameworkgroup: C1[X(C19H18N2O8)]
method: RPBEPBE
basis: SDD
operation: Freq
keyword: #p
keyword: freq=noraman
keyword: PBEPBE/SDD
title: #p freq=noraman PBEPBE/SDD
converged: YES YES NO NO
title: Mulliken charges:
elementType: O O O O O O O O N N C C C C C C C C C C C C C C C C C C C H H H H H H H H H H H H H H H H H H
charge: -0.260652 -0.287728 -0.260241 -0.213229 -0.238143 -0.290193 -0.209892 -0.208573 -0.400032 0.023588 -0.180312 -0.539289 0.237309 0.269923 0.313287 -0.478390 0.388236 0.467237 -0.376284 -0.277577 -0.381931 -0.368871 0.380950 -0.327711 -0.347513 -0.225545 -0.228061 -0.231903 -0.505044 0.311286 0.281978 0.264908 0.336867 0.245774 0.225282 0.276423 0.309110 0.234325 0.269009 0.291498 0.288566 0.228769 0.229581 0.231163 0.246262 0.238850 0.246934
chargesum: 0.00000
title: Mulliken charges with hydrogens summed into heavy atoms:
elementType: O O O O O O O O N N C C C C C C C C C C C C C C C C C C C
charge: -0.260652 -0.287728 -0.260241 -0.213229 -0.238143 -0.290193 -0.209892 -0.208573 -0.063165 0.023588 0.130974 0.007598 0.237309 0.269923 0.313287 -0.007334 0.388236 0.467237 -0.099860 0.031532 -0.147606 -0.099862 0.380950 -0.036213 -0.058947 0.003224 0.001520 -0.000741 0.227002
polarizability: 3.58888207e+02 -3.93705070e+01 2.16148742e+02 -4.04041996e+00 1.03383274e+01 2.04868501e+02
1716.lowfreq: -6.4986 -3.0327 -0.0004 0.0006 0.0010 0.9214 5.8292 10.7727 17.2799
frequency: 5.3604 10.2641 17.2640 20.6986 25.4954 32.3427 42.1603 43.2024 65.1595 69.3905 74.2139 81.3980 91.7345 100.2454 137.8860 141.8004 152.3267 182.5459 194.7754 200.4593 212.0112 237.8580 252.3633 287.6982 304.2440 320.3029 326.5937 339.5816 365.5648 389.4392 403.8306 415.5768 458.0147 486.5931 500.2204 506.8213 518.8323 548.6078 589.5818 594.5632 612.4774 617.4480 622.2392 640.9630 659.7256 665.1390 694.8774 697.6031 705.6636 720.2946 734.0385 744.9627 759.6220 798.4633 816.1624 836.4079 844.8175 845.2302 857.9659 869.3623 873.9560 934.8009 948.1828 955.8050 978.0410 982.7240 988.8486 990.4282 999.6682 1000.9314 1001.1009 1010.3554 1026.8273 1068.4452 1091.0788 1093.5034 1102.5434 1110.8277 1114.3579 1118.6181 1150.2188 1154.0048 1163.5560 1173.9292 1177.9773 1188.9471 1195.2580 1217.4487 1222.1976 1222.6749 1236.5246 1289.5682 1291.0645 1329.4132 1338.2563 1347.3242 1355.8565 1361.9928 1385.8470 1403.1856 1423.6178 1424.2110 1430.4301 1442.7780 1453.8392 1461.0180 1462.9184 1470.2163 1482.0202 1484.8362 1590.9662 1594.7264 1607.6681 1614.7077 1632.5554 1643.9696 1654.7185 3009.3001 3012.0778 3039.3191 3078.9010 3090.5353 3113.3273 3113.6719 3121.5665 3129.1310 3140.8685 3151.7442 3156.6518 3165.9670 3173.7412 3181.6366 3192.9901 3216.1026 3554.4353
redmass: 7.4452 5.5370 5.7264 5.2405 4.4401 5.7725 6.6120 6.0017 5.2848 7.4733 6.2976 3.1238 1.5913 6.5975 7.2994 4.9214 6.9547 4.4363 7.6113 3.7426 7.8308 6.3829 6.1740 5.8852 4.9928 7.2216 4.2982 6.2376 2.7176 7.1193 2.8120 3.0065 4.1730 3.7869 3.5106 6.7335 4.8786 3.1045 1.4581 2.6397 6.7029 6.2593 6.6877 7.0448 5.4792 4.7599 5.6159 5.6886 1.9995 6.8596 4.8872 8.2861 2.1749 7.5290 3.5087 5.2753 2.7822 1.7025 1.2546 4.5883 1.6000 1.5339 4.5766 3.6863 2.1657 1.4484 1.3309 5.5192 1.3810 2.8650 1.3371 2.9519 2.2126 5.2883 1.5132 3.1705 3.7684 1.3500 1.2791 2.7241 1.4467 1.8679 3.3637 1.0541 1.4762 1.1240 2.1762 1.9709 2.9160 6.0287 1.1612 1.3957 1.2814 1.2607 1.4882 1.3294 1.5357 8.0513 8.1201 11.0672 3.9027 1.2080 1.0870 2.1746 1.0496 1.1307 1.0510 2.3594 1.9241 2.2346 7.2895 6.0981 7.1102 6.0874 8.9675 10.2065 9.2226 1.0317 1.0610 1.0586 1.0914 1.0917 1.1074 1.1050 1.0867 1.0874 1.0921 1.0965 1.1051 1.1017 1.0896 1.0913 1.0972 1.0953 1.0774
irintensity: 0.1313 0.1641 0.4109 0.0644 0.1538 1.6106 0.4869 3.0217 2.1341 0.3452 4.8252 0.4617 0.2933 3.7066 0.8285 0.2241 0.6324 5.1139 0.3258 8.1645 5.3956 1.4533 22.9339 6.2286 43.8929 0.5689 0.7389 5.2820 28.4224 3.8569 0.0810 0.0419 15.1504 4.0717 7.4606 1.7650 15.2416 1.9506 146.7709 21.7390 1.8107 0.7905 8.2017 18.6158 2.9713 21.0209 0.7414 16.2481 67.9295 23.3949 6.7648 9.3698 70.1981 24.0526 9.1736 17.8929 3.0837 4.8242 0.4890 44.3727 91.2412 27.1896 132.5244 88.0942 127.0793 20.6476 0.2926 2.1181 0.2991 5.6280 0.5420 15.1010 4.0693 230.0722 8.3462 6.0329 637.1946 73.3078 3.0216 57.6065 2.5879 285.8386 384.7903 0.1167 181.8115 1.3001 87.0381 78.9151 83.2948 237.7745 10.0038 252.0635 19.9209 1.9291 82.1114 13.0577 7.0215 91.1741 0.8711 24.2541 45.0492 36.3500 47.0874 9.5018 15.5298 12.4235 14.4829 93.1240 280.3887 88.3714 73.6182 1.8678 93.3968 0.4171 171.1183 276.9532 155.7815 29.6356 2.8931 31.1159 7.0278 2.7077 4.3472 21.8810 5.4537 1.2371 16.6397 27.3438 14.9689 22.5069 0.2608 1.5587 2.7009 3.2134 36.8727
temp: 298.150 k
press: 1.00000 atm
elementType: 8 8 8 8 8 8 8 8 7 7 6 6 6 6 6 6 6 6 6 6 6 6 6 6 6 6 6 6 6 1 1 1 1 1 1 1 1 1 1 1 1 1 1 1 1 1 1
symmnumber: 1
zpe: 912774.3 jmol-1
zpe.correction: 0.347657 hartree
zpe.thermalcorrener: 0.375509 hartree
zpe.thermalcorrenthalpy: 0.376453 hartree
zpe.thermalcorrgfe: 0.280646 hartree
zpe.sumelectzpe: -1443.944238 hartree
zpe.sumelectthermal: -1443.916386 hartree
zpe.sumelectthermalent: -1443.915442 hartree
zpe.sumelectthermalfe: -1444.011248 hartree
dipole: -7.3406 3.4200 0.9647
dipole: 8.1555
quadrupole: -205.3127 -148.5816 -164.5399
quadrupole: 16.5781 -3.6139 -5.2822
quadrupole: -32.5013 24.2298 8.2715 16.5781 -3.6139 -5.2822
hfenergy: -1444.2918949 hartree
pointgroup: C01 [X(C19H18N2O8)]
dipole: -2.6310961 -1.697206 -0.7013998 debye
polarizability: 343.2504028|57.1541878|227.7262151|15.192052|16.0076213|208.9288325 unknown
InChI: InChI=1S/C19H18N2O8/c1-27-17(22)11-16(20-19(24)28-12-13-5-3-2-4-6-13)18(23)29-15-9-7-14(8-10-15)21(25)26/h2-10,16,20H,11-12H2,1H3
charge 0 multiplicity 1
47 atoms
O  1.725419 0.128205 0.400814
O  -2.893978 1.281439 -0.765952
O  0.290523 -4.858162 -0.491127
O  1.725384 -0.781704 -1.775681
O  1.619311 -3.205284 0.473334
O  -2.172984 0.317647 1.269427
O  6.860837 3.549944 1.929592
O  7.52902 2.809583 -0.122653
N  -1.207282 -0.230025 -0.803653
N  6.670492 2.88155 0.840151
C  -0.197401 -1.149032 -0.266302
C  -0.398874 -2.583146 -0.801674
C  1.195317 -0.623755 -0.65759
C  0.613642 -3.540687 -0.196984
C  -2.094847 0.440003 0.020077
C  -3.996643 1.997956 -0.030345
C  2.985161 0.78304 0.394785
C  -5.268032 1.178842 -0.001242
C  3.225101 1.525809 1.576044
C  3.942329 0.717799 -0.64894
C  -6.229055 1.307855 -1.036169
C  -5.513581 0.271492 1.062203
C  5.389945 2.153848 0.687058
C  4.435792 2.219424 1.72841
C  5.156753 1.414102 -0.491661
C  -7.414719 0.54043 -1.014372
C  -6.698829 -0.496345 1.084852
C  -7.651672 -0.363774 0.047366
C  1.23531 -5.886224 0.0199
H  -0.290695 -1.122466 0.830991
H  -1.422192 -2.928405 -0.576647
H  -0.278502 -2.604606 -1.901872
H  -1.259252 -0.057885 -1.809633
H  -3.629609 2.223176 0.985438
H  -4.113505 2.924026 -0.61432
H  2.456741 1.541312 2.353476
H  3.742968 0.142296 -1.552637
H  -6.046659 2.009175 -1.859798
H  -4.766961 0.166728 1.85757
H  4.655222 2.802017 2.626247
H  5.923912 1.390755 -1.269842
H  -8.152415 0.649007 -1.817198
H  -6.881491 -1.193104 1.910474
H  -8.572727 -0.957233 0.067527
H  1.286532 -5.840292 1.120252
H  0.815928 -6.842567 -0.320454
H  2.240772 -5.717466 -0.39984
